program: Gaussian 09
title: 000040573
version: EM64L-G09RevD.01
frameworkgroup: C1[X(C17H23NO3)]
method: RPBEPBE
basis: SDD
operation: Freq
keyword: #p
keyword: freq=noraman
keyword: PBEPBE/SDD
title: #p freq=noraman PBEPBE/SDD
converged: YES YES NO NO
title: Mulliken charges:
elementType: O O O N C C C C C C C C C C C C C C C C C H H H H H H H H H H H H H H H H H H H H H H H
charge: -0.298532 -0.320094 -0.302396 -0.141580 0.275456 -0.186649 -0.210397 -0.433462 -0.431169 -0.434840 -0.440376 -0.429341 0.421619 0.305043 -0.372221 -0.413573 -0.539860 -0.253789 -0.258208 -0.242147 -0.489577 0.221810 0.207290 0.196391 0.228832 0.212130 0.193982 0.253361 0.241508 0.238121 0.252244 0.198334 0.234726 0.235965 0.235650 0.230074 0.229950 0.200478 0.227192 0.227021 0.230567 0.223348 0.239775 0.237342
chargesum: 0.00000
title: Mulliken charges with hydrogens summed into heavy atoms:
elementType: O O O N C C C C C C C C C C C C C C C C C
charge: -0.298532 -0.320094 -0.302396 -0.141580 0.275456 0.035160 -0.003107 -0.008239 -0.025056 0.060029 0.049989 0.003718 0.421619 0.305043 -0.136256 -0.177924 0.120643 -0.026596 -0.031187 -0.011580 0.210890
polarizability: 2.22938030e+02 1.83406309e+01 1.78248590e+02 -5.49050494e+00 4.49899809e+00 1.72209760e+02
1716.lowfreq: -15.3173 -7.0213 -0.0008 -0.0006 -0.0002 8.8407 28.1658 50.4192 64.5388
frequency: 28.0980 50.4118 64.5257 73.9950 85.4128 101.9613 118.1196 132.6534 142.6994 162.3814 185.0520 206.7678 223.2102 239.1942 275.9291 289.5254 298.8680 307.7306 319.8368 334.6626 378.8877 404.1767 406.7966 427.3763 468.3162 483.5476 507.7677 550.6006 571.5953 614.9374 621.3885 648.5180 664.4417 693.4427 707.2452 733.9794 766.3714 785.0843 814.3513 818.4929 854.5082 861.5148 875.7429 892.3558 912.1732 927.2992 962.8033 971.4951 979.9645 982.6716 990.9720 992.2412 997.2817 1001.9849 1019.8150 1032.2341 1056.5109 1076.9552 1090.9114 1102.9149 1113.2223 1117.7685 1119.5915 1120.2202 1145.1613 1154.3429 1162.9229 1173.9710 1191.5126 1199.5752 1206.6029 1225.6669 1234.2079 1261.3904 1262.8130 1287.7950 1293.9488 1312.8153 1322.8471 1336.9443 1342.7008 1358.1093 1363.8671 1367.3644 1370.7608 1377.7618 1395.1115 1428.6908 1433.7423 1437.9098 1448.5405 1453.6169 1460.1999 1463.6509 1470.6345 1476.7120 1479.7183 1483.1144 1483.8286 1494.6793 1587.8866 1609.8001 1643.7523 2943.0088 2964.5523 2970.4603 2978.6478 2985.9098 2991.1620 2999.2841 3003.8149 3019.9239 3026.3017 3035.7329 3052.2377 3073.2337 3078.1694 3094.3961 3097.2977 3099.5195 3122.8669 3130.6257 3136.6918 3145.3299 3151.9822 3165.1577
redmass: 4.5420 3.5907 1.5575 2.5481 3.5906 3.4172 3.1312 3.0342 2.9768 2.5791 1.6482 3.3959 2.8879 3.5610 3.7724 2.8220 3.7396 3.8906 4.2109 2.8189 2.4301 2.6359 2.6014 3.1429 3.5908 3.6013 3.6062 4.1506 3.2992 6.2640 3.7545 4.9545 5.3584 11.0997 1.5988 4.8877 2.1951 2.1674 2.5856 2.6976 1.2740 1.5509 3.5125 2.9249 3.3700 1.5963 1.9018 2.1626 1.5365 2.7451 2.9588 3.3354 1.4452 3.5830 6.3886 2.1259 3.5050 1.8465 1.5213 1.7531 1.3682 1.2731 1.7708 1.6824 1.4277 1.3943 1.5066 1.0619 2.0328 1.4056 1.6559 2.0557 2.0833 1.3277 1.3913 1.7275 1.8207 1.3834 1.3688 1.4974 1.4057 1.3303 1.4165 1.3478 1.5021 5.3599 1.7687 1.1312 2.1974 1.3860 1.0509 1.0816 1.0540 1.0816 1.0570 1.0792 1.0555 1.2240 1.7416 1.0870 5.8744 6.0113 9.2602 1.0347 1.0688 1.0726 1.0676 1.0670 1.0687 1.0296 1.0676 1.0836 1.1001 1.0991 1.0986 1.0985 1.0933 1.0922 1.0989 1.1045 1.0844 1.0874 1.1045 1.0915 1.0950 1.1010
irintensity: 0.0158 0.2067 0.1416 1.6561 0.9491 2.2079 0.9027 0.7204 8.9650 0.6392 0.8275 1.2374 3.7152 2.1088 2.0864 1.8507 3.1939 20.7120 2.7960 5.9205 9.7325 2.3679 1.4936 0.8200 0.5349 4.5876 6.3086 17.5784 5.0289 0.1357 2.0373 1.1860 4.1942 17.0279 58.7221 15.4044 33.5450 29.2151 1.7299 1.0050 0.0737 0.4534 1.2899 8.2120 3.5041 10.8143 17.8547 30.6168 12.7185 18.9802 17.0568 16.6503 1.7698 11.8027 74.7207 3.2133 85.2185 3.9942 5.2208 30.0541 14.2020 2.2674 50.4228 43.4937 41.6386 2.0780 0.6968 0.0865 18.0593 11.8961 8.8852 61.8407 129.4985 4.3216 19.3186 11.5657 30.3403 0.4367 3.4885 22.0942 11.5453 0.7011 0.4104 10.1215 39.7617 2.8006 34.9020 2.9041 6.0327 121.0401 11.4121 7.2901 5.5710 13.6587 8.1788 16.2235 10.9998 17.7999 20.4194 10.6680 1.8489 2.9554 428.0868 58.4856 31.7995 6.6578 42.4170 19.2746 116.1803 52.5755 90.1249 26.2381 61.0840 8.6937 2.8398 67.4402 5.7508 7.0691 25.6804 29.8577 2.4471 2.7300 19.1225 26.3475 35.9037 16.2713
temp: 298.150 k
press: 1.00000 atm
elementType: 8 8 8 7 6 6 6 6 6 6 6 6 6 6 6 6 6 6 6 6 6 1 1 1 1 1 1 1 1 1 1 1 1 1 1 1 1 1 1 1 1 1 1 1
symmnumber: 1
zpe: 976347.1 jmol-1
zpe.correction: 0.371871 hartree
zpe.thermalcorrener: 0.391612 hartree
zpe.thermalcorrenthalpy: 0.392556 hartree
zpe.thermalcorrgfe: 0.323919 hartree
zpe.sumelectzpe: -940.429160 hartree
zpe.sumelectthermal: -940.409419 hartree
zpe.sumelectthermalent: -940.408475 hartree
zpe.sumelectthermalfe: -940.477112 hartree
dipole: -2.1626 0.0668 -2.8731
dipole: 3.5967
quadrupole: -119.5711 -124.5349 -122.0244
quadrupole: 4.7513 -8.4963 2.0614
quadrupole: 2.4723 -2.4914 0.0191 4.7513 -8.4963 2.0614
hfenergy: -940.8010311 hartree
pointgroup: C01 [X(C17H23N1O3)]
dipole: -0.8294051 -0.0229445 -1.1462539 debye
polarizability: 223.3918908|17.6821843|178.4376277|-5.3655291|4.5633501|171.566862 unknown
InChI: InChI=1S/C17H23NO3/c1-20-16(19)18-11-14-9-6-10-15(12-18)17(14,21-2)13-7-4-3-5-8-13/h3-5,7-8,14-15H,6,9-12H2,1-2H3
charge 0 multiplicity 1
44 atoms
O  -1.647354 2.122822 -0.046806
O  3.699687 -1.144804 -0.79536
O  3.583238 -1.100726 1.552057
N  1.71827 -0.554026 0.229354
C  -0.866826 0.842697 -0.045439
C  -0.019408 0.929338 1.262362
C  0.163654 0.807583 -1.221097
C  0.80664 2.2458 1.296307
C  0.958936 2.142892 -1.2649
C  0.846481 -0.346587 1.406323
C  1.09326 -0.436823 -1.105336
C  1.71022 2.455814 0.054204
C  -1.890028 -0.314698 -0.031506
C  3.022119 -0.944592 0.431419
C  -2.721791 -0.485753 1.108156
C  -2.129048 -1.152248 -1.151505
C  -2.549394 2.317191 -1.183722
C  -3.72615 -1.475485 1.142569
C  -3.136373 -2.144038 -1.125734
C  -3.935592 -2.317328 0.025017
C  5.112015 -1.547281 -0.644596
H  -0.704817 0.945196 2.130449
H  -0.366655 0.703097 -2.189546
H  1.423966 2.255417 2.216203
H  0.091672 3.084304 1.369452
H  0.248566 2.964394 -1.474965
H  1.674642 2.107176 -2.110213
H  1.497582 -0.275109 2.29301
H  0.189242 -1.230776 1.54044
H  0.516404 -1.360093 -1.313589
H  1.894741 -0.369373 -1.856446
H  2.061499 3.505842 0.032832
H  2.613209 1.825658 0.129613
H  -2.599173 0.178613 1.969763
H  -1.539798 -1.032504 -2.066464
H  -3.046757 3.282615 -0.997544
H  -3.311882 1.516471 -1.24748
H  -2.002284 2.372706 -2.147752
H  -4.350352 -1.585822 2.036577
H  -3.29577 -2.777769 -2.005571
H  -4.714078 -3.087922 0.048936
H  5.477259 -1.672165 -1.674665
H  5.187462 -2.492316 -0.080538
H  5.685165 -0.768089 -0.113864
