program: Gaussian 09
title: 000040534
version: EM64L-G09RevD.01
frameworkgroup: C1[X(C17H23Cl2N)]
method: RPBEPBE
basis: SDD
operation: Freq
keyword: #p
keyword: freq=noraman
keyword: PBEPBE/SDD
title: #p freq=noraman PBEPBE/SDD
converged: YES YES NO NO
title: Mulliken charges:
elementType: Cl Cl N C C C C C C C C C C C C C C C C C H H H H H H H H H H H H H H H H H H H H H H H
charge: -0.022695 -0.013248 -0.081170 -0.064777 -0.116279 -0.096664 -0.271045 -0.495192 -0.502674 -0.487379 -0.471713 -0.473469 0.572821 -0.457875 -0.414848 -0.624462 -0.616724 -0.069339 -0.227748 -0.117753 0.238478 0.219857 0.220968 0.209879 0.203253 0.220181 0.212545 0.212628 0.215216 0.214373 0.206585 0.232863 0.201149 0.216264 0.263099 0.236551 0.226152 0.192512 0.220212 0.220969 0.189043 0.224675 0.254782
chargesum: 0.00000
title: Mulliken charges with hydrogens summed into heavy atoms:
elementType: Cl Cl N C C C C C C C C C C C C C C C C C
charge: -0.022695 -0.013248 -0.081170 0.173701 0.103578 0.124304 -0.061166 -0.071757 -0.077501 -0.057790 -0.032266 -0.056056 0.572821 -0.194776 -0.178297 0.014414 0.017963 -0.069339 0.027034 -0.117753
polarizability: 2.61683854e+02 1.35672876e+01 1.64117159e+02 1.17682048e+00 -6.45610025e+00 1.85313167e+02
1716.lowfreq: -3.7968 -0.0024 -0.0019 0.0018 5.3728 10.1282 22.2773 28.5825 39.7263
frequency: 22.0618 27.7169 39.5891 50.6519 72.9080 100.2326 139.6660 151.2565 168.0932 183.0021 195.7070 203.5457 226.0727 245.0381 254.3656 258.1498 301.4130 311.4435 344.7731 368.1767 378.7746 394.6578 427.8260 442.9796 455.2838 477.6962 484.1971 537.0794 580.8895 588.6942 631.2289 655.0179 696.9502 715.8212 776.9067 783.2777 793.1110 805.2390 817.6172 840.5343 847.4330 869.9634 886.3425 893.4737 937.1083 939.7667 952.6883 963.7979 999.8787 1001.7320 1025.5844 1034.3329 1047.7958 1056.0023 1064.6466 1077.3573 1089.6706 1101.6166 1106.9243 1122.1243 1133.5036 1147.8537 1148.3876 1164.5901 1181.0654 1196.0729 1207.7387 1227.9068 1232.5684 1240.5131 1259.5207 1261.0158 1268.9709 1279.5705 1282.8058 1306.0628 1312.4760 1317.9975 1323.6412 1324.7837 1337.0217 1354.7270 1361.0521 1364.7291 1375.2097 1398.2075 1420.8463 1440.4439 1460.4728 1460.7622 1463.8152 1466.7577 1473.0116 1474.9427 1477.6555 1480.9452 1486.3907 1493.6589 1564.8083 1593.0264 2822.4416 2849.1824 2864.1843 2947.8493 2972.9284 2975.2628 2983.8083 2991.3534 2994.5848 3007.5576 3012.1020 3017.7380 3021.3333 3024.0745 3028.0097 3031.7879 3048.0029 3054.3561 3076.2038 3083.4588 3143.4030 3146.2750 3168.1302
redmass: 4.6417 5.0830 2.7487 4.2364 3.6930 3.9647 4.4747 3.4766 8.3859 5.2839 3.6942 2.3079 1.6905 1.3390 1.8042 2.4986 2.2624 3.4488 4.4829 2.3927 2.3961 2.6738 6.3083 3.0363 2.4948 6.3453 4.0545 3.5054 4.0784 4.8438 6.1018 6.4038 4.3738 3.7232 1.8120 2.5583 2.3297 1.6050 1.7506 2.1838 3.0739 2.4723 2.2434 1.6078 1.8958 2.4516 1.3709 3.2779 2.7701 3.2247 2.3369 1.5610 2.1430 2.0868 1.9111 1.8933 1.3496 1.5642 1.9361 2.0965 1.3889 1.5282 1.1288 1.5969 1.6565 1.3247 2.0479 1.1444 1.2393 1.4340 1.7666 1.8693 1.6123 1.6413 1.5775 1.5994 1.2980 1.5792 1.5449 1.5295 1.4922 1.4955 1.4647 1.3988 5.2019 1.8953 1.1420 1.1481 1.3979 1.6753 1.0610 1.0785 1.0729 1.0786 1.0581 1.0847 1.0544 1.0912 7.2368 6.7476 1.0701 1.0570 1.0570 1.0830 1.0601 1.0596 1.0809 1.0661 1.0620 1.0873 1.0813 1.0727 1.1026 1.1022 1.0724 1.0860 1.1033 1.1026 1.1011 1.1002 1.0882 1.0917 1.0960
irintensity: 0.0658 0.3071 0.5411 0.0518 0.2620 0.5524 0.2053 0.2047 0.1271 0.2836 0.0279 0.1199 0.4668 0.5145 0.0162 0.3229 4.6008 1.3480 0.2671 6.7721 0.3740 1.4739 4.1435 4.8128 0.8830 18.3640 0.2757 2.1052 3.7390 9.6657 2.3442 9.9233 8.4208 8.2149 6.5995 3.3911 8.2496 2.3489 49.5177 7.6113 14.2216 3.7490 7.2940 7.1384 1.7303 10.1492 0.8027 5.1909 11.7219 21.5544 34.0090 14.0543 10.5106 1.9899 1.4872 1.8538 5.1199 6.2262 4.8985 45.2963 6.1390 2.1027 1.6430 6.9881 1.7478 6.4806 6.4175 0.0327 1.6534 20.7288 3.9811 5.1393 10.0036 1.2539 6.1685 0.3335 1.1395 1.6167 1.9369 1.9484 2.3474 3.0956 2.3432 6.7193 0.4516 20.6130 3.2252 0.6265 35.5782 74.5999 11.3807 0.1030 6.7407 9.5576 22.4071 27.1538 13.8188 8.9896 17.8758 7.2993 73.2512 64.3317 210.1216 21.0142 44.3038 12.8803 10.4925 29.4442 84.8712 53.1603 80.2051 44.0690 4.6601 2.5736 33.1712 34.4687 32.7707 130.4954 28.2639 54.9568 8.8993 3.2789 4.1640
temp: 298.150 k
press: 1.00000 atm
elementType: 17 17 7 6 6 6 6 6 6 6 6 6 6 6 6 6 6 6 6 6 1 1 1 1 1 1 1 1 1 1 1 1 1 1 1 1 1 1 1 1 1 1 1
symmnumber: 1
zpe: 951003.9 jmol-1
zpe.correction: 0.362218 hartree
zpe.thermalcorrener: 0.381793 hartree
zpe.thermalcorrenthalpy: 0.382738 hartree
zpe.thermalcorrgfe: 0.312573 hartree
zpe.sumelectzpe: -1634.935091 hartree
zpe.sumelectthermal: -1634.915516 hartree
zpe.sumelectthermalent: -1634.914571 hartree
zpe.sumelectthermalfe: -1634.984736 hartree
dipole: -3.5911 -0.0452 -0.4500
dipole: 3.6195
quadrupole: -152.0371 -132.0372 -129.6970
quadrupole: -2.3571 -3.5137 -1.0978
quadrupole: -14.1133 5.8866 8.2268 -2.3571 -3.5137 -1.0978
hfenergy: -1635.2973091 hartree
pointgroup: C01 [X(C17H23Cl2N1)]
dipole: 1.4061418 -0.0618322 0.2161828 debye
polarizability: 260.4652717|-17.0676989|165.5771173|3.8971863|6.5433157|185.0717911 unknown
InChI: InChI=1S/C17H23Cl2N/c1-20(2)10-14-11-3-5-12(6-4-11)17(14)13-7-8-15(18)16(19)9-13/h7-9,11-12,14,17H,3-6,10H2,1-2H3
charge 0 multiplicity 1
43 atoms
Cl -4.60923 0.244053 -2.145314
Cl -5.431269 1.012967 0.958063
N  3.021128 2.209618 -0.130074
C  2.672457 -0.805757 0.54502
C  0.595105 -2.155978 -0.274226
C  1.525832 0.177659 0.173323
C  0.35962 -0.619164 -0.51256
C  3.064461 -1.6848 -0.672298
C  2.166523 -1.731875 1.68328
C  1.846228 -2.575456 -1.091869
C  0.852976 -2.455697 1.225127
C  1.974052 1.349355 -0.731872
C  -1.048485 -0.1755 -0.12214
C  -2.056001 -0.14078 -1.120387
C  -1.424468 0.159449 1.206113
C  2.529273 3.021995 1.001476
C  3.697383 3.046922 -1.142513
C  -3.3826 0.213915 -0.808185
C  -2.751934 0.51514 1.522898
C  -3.737559 0.54398 0.515631
H  3.54504 -0.214931 0.880219
H  -0.292722 -2.717098 -0.625535
H  1.154213 0.608154 1.124297
H  0.446478 -0.471147 -1.610395
H  3.93201 -2.315157 -0.400316
H  3.397432 -1.047049 -1.512692
H  1.987053 -1.137029 2.600321
H  2.95203 -2.470444 1.933533
H  1.63844 -2.476535 -2.174954
H  2.057471 -3.645645 -0.90438
H  0.940324 -3.549971 1.362923
H  -0.015105 -2.135281 1.830535
H  1.06667 1.946185 -1.018978
H  2.387404 0.934332 -1.672439
H  -1.807089 -0.388267 -2.157875
H  -0.681161 0.153408 2.009494
H  2.143177 2.372726 1.805597
H  1.713536 3.731722 0.708304
H  3.36385 3.612244 1.420049
H  4.520409 3.612093 -0.668824
H  3.014654 3.784476 -1.636851
H  4.132709 2.404303 -1.928438
H  -3.031613 0.772567 2.548813
