program: Gaussian 09
title: 000040553
version: EM64L-G09RevD.01
frameworkgroup: C1[X(C17H16ClN3O)]
method: RPBEPBE
basis: SDD
operation: Freq
keyword: #p
keyword: freq=noraman
keyword: PBEPBE/SDD
title: #p freq=noraman PBEPBE/SDD
converged: YES YES NO NO
title: Mulliken charges:
elementType: Cl O N N N C C C C C C C C C C C C C C C C C H H H H H H H H H H H H H H H H
charge: -0.045352 -0.199252 -0.113439 -0.061204 -0.431611 -0.160137 0.221280 -0.008278 0.308869 0.085335 0.304947 -0.334094 -0.404015 -0.648235 -0.636636 -0.142887 -0.210232 -0.366144 -0.367867 -0.235369 -0.229873 -0.236520 0.225486 0.327718 0.298059 0.247393 0.272976 0.176495 0.224426 0.261604 0.224136 0.178985 0.263275 0.253649 0.262437 0.230751 0.230707 0.232618
chargesum: 0.00000
title: Mulliken charges with hydrogens summed into heavy atoms:
elementType: Cl O N N N C C C C C C C C C C C C C C C C C
charge: -0.045352 -0.199252 -0.113439 -0.061204 -0.103893 0.065349 0.221280 -0.008278 0.308869 0.085335 0.304947 -0.036034 -0.156621 0.025661 0.028089 -0.142887 0.053043 -0.112495 -0.105431 -0.004618 0.000833 -0.003902
polarizability: 2.90588765e+02 -1.89992594e+00 2.51809376e+02 -5.13690941e+00 1.76878728e+01 1.45231918e+02
1716.lowfreq: -4.5931 0.0008 0.0015 0.0015 3.9462 4.9280 34.6006 53.5984 58.4335
frequency: 34.5888 53.5808 58.4166 67.5800 71.1899 88.0296 131.2112 145.1994 177.7229 184.3872 219.2367 228.0108 237.3346 260.4281 285.1464 293.4425 308.3351 316.8515 335.3939 354.8343 389.7397 405.9953 425.8549 432.4556 453.3096 488.4056 494.6396 522.5588 573.6994 596.0692 616.2793 621.0066 652.5433 662.5920 685.1696 700.0788 709.7381 735.6060 776.4775 789.8460 815.3643 829.9959 856.7443 880.0137 896.1954 903.9134 936.0949 940.5210 949.4291 985.3769 988.6590 990.1600 1001.9922 1027.5683 1036.7951 1065.2219 1085.2803 1087.0883 1097.3446 1122.4103 1135.6047 1164.6480 1173.5201 1184.0427 1188.8153 1213.1790 1250.4933 1259.4042 1269.2277 1280.2504 1297.3581 1316.8737 1340.6759 1361.6104 1381.1945 1385.6419 1410.0236 1434.4546 1437.3804 1439.7638 1463.3301 1468.5469 1471.6345 1481.4497 1481.7488 1488.9956 1544.9643 1574.0448 1588.9914 1597.7352 1609.8642 1648.7535 2696.9398 2840.8288 2854.9533 3038.0233 3043.8462 3107.1980 3109.9443 3128.0212 3137.8923 3138.2442 3150.1958 3161.3756 3167.8598 3171.7680 3175.9089 3504.7359
redmass: 5.1544 4.0050 4.8924 5.3894 4.0927 3.8620 8.1103 3.8505 5.7868 3.6401 2.5958 1.5003 1.2733 3.6999 5.0805 4.8151 7.0839 5.6022 4.7207 5.1183 3.9934 2.8673 4.7387 3.3180 4.0049 3.8970 5.0462 4.0296 3.3699 3.1372 6.3400 5.1331 4.3295 4.7771 4.7669 1.8083 2.9607 3.1992 4.2490 2.6980 1.8561 3.6507 1.2538 5.0298 2.4407 1.9739 2.0234 2.3531 1.3842 1.4226 4.5444 5.8238 1.3512 2.1513 1.5538 2.1904 1.7465 1.9103 1.2891 2.1375 1.4089 2.1739 1.0665 2.2769 1.1317 3.5372 1.7688 1.5776 2.4304 2.2629 3.3964 1.3663 1.3948 2.8433 7.2508 6.6517 1.1409 2.2797 1.1856 2.1411 1.0579 2.6360 1.0602 2.2309 1.0848 1.0520 8.5442 7.3891 6.7449 6.8232 6.1812 6.3136 1.0748 1.0582 1.0580 1.0725 1.0723 1.0987 1.0995 1.0849 1.0884 1.0899 1.0931 1.0964 1.0925 1.0996 1.0961 1.0758
irintensity: 0.5026 0.3508 1.5380 0.6902 1.4339 0.3896 1.4492 0.7937 3.0801 0.6794 0.2118 0.4809 1.2722 1.5425 2.4346 1.4840 3.1452 1.9956 2.3131 5.9153 1.1421 0.0125 7.9337 1.9353 1.4659 1.4470 6.0653 18.5635 44.1208 11.9907 0.1886 7.3183 6.3298 22.0706 14.5150 46.0409 53.5097 12.9772 9.4393 40.3826 33.1279 28.0099 3.9082 33.0479 4.2910 17.4962 8.3789 17.6353 0.7410 1.2230 6.8251 0.0369 0.6890 7.3300 10.8408 116.8063 26.9943 9.9846 5.8217 22.1684 27.3805 1.4568 0.4870 56.9708 8.9260 24.0250 23.5885 12.0814 62.9205 7.7942 112.1471 7.7952 24.6013 15.1265 3.7898 6.6762 8.3773 12.3084 29.6971 10.5840 24.6078 115.2441 6.1496 3.3267 8.3186 44.7353 59.0873 25.7763 11.5126 0.6658 0.5894 461.2058 69.8862 57.2928 198.8175 34.8084 51.7697 19.8546 15.1079 0.5019 5.9129 6.1945 26.1862 20.2912 0.3285 17.6446 2.4336 32.6612
temp: 298.150 k
press: 1.00000 atm
elementType: 17 8 7 7 7 6 6 6 6 6 6 6 6 6 6 6 6 6 6 6 6 6 1 1 1 1 1 1 1 1 1 1 1 1 1 1 1 1
symmnumber: 1
zpe: 770700.8 jmol-1
zpe.correction: 0.293544 hartree
zpe.thermalcorrener: 0.312962 hartree
zpe.thermalcorrenthalpy: 0.313906 hartree
zpe.thermalcorrgfe: 0.245495 hartree
zpe.sumelectzpe: -1355.368927 hartree
zpe.sumelectthermal: -1355.349510 hartree
zpe.sumelectthermalent: -1355.348565 hartree
zpe.sumelectthermalfe: -1355.416977 hartree
dipole: -2.9786 -1.7271 0.7523
dipole: 3.5243
quadrupole: -149.1733 -117.4664 -135.8166
quadrupole: -8.1200 16.2682 9.0171
quadrupole: -15.0212 16.6857 -1.6645 -8.1200 16.2682 9.0171
hfenergy: -1355.6624718 hartree
pointgroup: C01 [X(C17H16Cl1N3O1)]
dipole: 0.7987859 -1.0671368 -0.3817056 debye
polarizability: 284.9966712|-12.2959957|257.6306321|-17.0874125|-7.7146708|145.0027561 unknown
InChI: InChI=1S/C17H16ClN3O/c1-21(2)16-17(22)19-14-9-8-12(18)10-13(14)15(20-16)11-6-4-3-5-7-11/h3-10,16,19H,1-2H3
charge 0 multiplicity 1
38 atoms
Cl 2.71507 -3.85153 -1.704849
O  -3.491857 0.222576 1.879193
N  -3.229246 1.455229 -0.718938
N  -0.917353 1.203176 -0.086255
N  -1.73808 -1.222403 1.444711
C  -2.205053 0.506546 -0.263303
C  0.258521 -0.990766 -0.03368
C  0.198684 0.506337 -0.007495
C  -0.682585 -1.793633 0.687576
C  -2.568636 -0.134009 1.108286
C  1.47558 1.281944 0.116459
C  1.290453 -1.644761 -0.763669
C  -0.531535 -3.207282 0.712509
C  -4.538099 0.811812 -0.955923
C  -2.78776 2.260372 -1.87591
C  1.394545 -3.04203 -0.745629
C  0.504486 -3.840359 0.004046
C  2.623552 0.740073 0.756512
C  1.529955 2.616091 -0.371843
C  3.798485 1.511228 0.895037
C  2.704756 3.381921 -0.239032
C  3.846172 2.831829 0.393626
H  -2.084876 -0.356786 -0.988068
H  -2.043948 -1.724051 2.284925
H  2.00536 -1.046701 -1.335262
H  -1.248541 -3.814225 1.276876
H  -4.906682 0.351286 -0.026431
H  -4.505672 0.035726 -1.76458
H  -5.264147 1.585644 -1.259354
H  -1.841735 2.76444 -1.625622
H  -3.552564 3.027958 -2.086947
H  -2.635549 1.655481 -2.80708
H  0.609184 -4.928757 0.019633
H  2.594053 -0.273985 1.168599
H  0.63437 3.033744 -0.841355
H  4.672319 1.083691 1.398815
H  2.73371 4.40658 -0.625705
H  4.759663 3.427892 0.497726
