program: Gaussian 09
title: 000040497
version: EM64L-G09RevD.01
frameworkgroup: C1[X(C4H3Cl5)]
method: RPBEPBE
basis: SDD
operation: Freq
keyword: #pfreq=noraman
keyword: PBEPBE/SDD
title: #p freq=noraman PBEPBE/SDD
converged: YES YES NO NO
title: Mulliken charges:
elementType: Cl Cl Cl Cl Cl C C C C H H H
charge: -0.025919 -0.034286 0.012328 0.105828 0.054656 -0.438880 -0.530488 0.385962 -0.434757 0.315433 0.295199 0.294924
chargesum: 0.00000
title: Mulliken charges with hydrogens summed into heavy atoms:
elementType: Cl Cl Cl Cl Cl C C C C
charge: -0.025919 -0.034286 0.012328 0.105828 0.054656 -0.123447 0.059635 0.385962 -0.434757
polarizability: 1.01854119e+02 -1.29917219e+01 8.54188912e+01 -5.09653304e-01 1.92876238e+00 8.89544572e+01
1716.lowfreq: -7.0011 -0.0033 -0.0007 0.0020 2.1796 8.8628 31.3610 55.5801 86.9300
frequency: 31.3323 55.5745 86.9288 114.6711 144.1185 182.7805 218.0460 269.4512 273.3231 328.7184 359.5660 406.0707 524.2423 540.4698 646.7406 680.2375 726.8222 840.4077 908.6780 1033.5769 1141.3811 1158.1606 1193.4622 1268.3953 1338.2192 1446.7628 1609.7221 3086.2158 3115.0885 3177.3654
redmass: 26.9761 25.0541 14.7447 24.2172 20.5538 6.7215 5.6615 14.0001 15.6508 15.9731 19.5516 6.6288 11.6711 4.0779 9.4167 6.3572 7.9036 9.0672 1.7281 2.5096 1.3152 2.3355 1.3253 1.1733 1.3808 1.0915 10.8997 1.0570 1.0868 1.1119
irintensity: 0.0600 0.3337 1.6166 2.3085 1.0056 2.7466 1.8391 2.3602 2.1616 0.9900 1.9865 21.7694 45.4027 9.0052 92.2000 13.2250 62.0487 104.3937 0.0952 16.4216 6.5528 20.1584 14.5639 3.7910 0.8654 12.3502 77.8326 5.1751 0.6542 0.9311
temp: 298.150 k
press: 1.00000 atm
elementType: 17 17 17 17 17 6 6 6 6 1 1 1
symmnumber: 1
zpe: 160936.8 jmol-1
zpe.correction: 0.061298 hartree
zpe.thermalcorrener: 0.072027 hartree
zpe.thermalcorrenthalpy: 0.072972 hartree
zpe.thermalcorrgfe: 0.021805 hartree
zpe.sumelectzpe: -2453.796980 hartree
zpe.sumelectthermal: -2453.786250 hartree
zpe.sumelectthermalent: -2453.785306 hartree
zpe.sumelectthermalfe: -2453.836472 hartree
dipole: -0.4470 0.0591 -0.5388
dipole: 0.7025
quadrupole: -83.6498 -93.8504 -85.0142
quadrupole: -1.4341 0.4622 1.4973
quadrupole: 3.8550 -6.3456 2.4906 -1.4341 0.4622 1.4973
hfenergy: -2453.8582774 hartree
pointgroup: C01 [X(C4H3Cl5)]
dipole: 0.1822708 0.0601074 -0.1988902 debye
dipolederiv: -0.4239396 0.055575 0.0469219 0.2665871 -0.5355217 -0.2813705 0.2024038 -0.2830012 -0.3115221 -0.2032797 -0.0247263 -0.0299494 -0.0773843 -0.5027388 -0.2116615 -0.0522645 -0.1961997 -0.2617008 -0.1264338 0.0306004 -0.0434857 0.076462 -0.1631598 0.2612505 -0.0998293 0.2500612 -0.4031537 -0.6209596 -0.0354468 0.2466196 -0.1089569 0.0100263 0.1336436 0.3315411 0.1094214 -0.2037109 -0.1583875 0.0378726 -0.0252409 0.0894637 -0.1792209 0.3300505 -0.0908351 0.3481011 -0.5037179 0.6870903 -0.0885776 -0.1140259 -0.1777296 0.5317778 0.4188075 -0.4409765 0.4171196 0.2106845 0.0692326 0.040277 0.016677 0.0800962 0.5796534 0.198794 0.0929788 0.2449765 0.2545676 -0.4761342 0.0467704 0.0970544 -0.1786424 0.103715 -0.3629582 0.1808961 -0.3231671 0.4111896 1.0624994 -0.0687866 -0.2402309 -0.0336204 0.1876372 -0.4897651 -0.1774127 -0.5151432 0.7397256 0.0719771 0.026275 -0.0098498 0.0266704 -0.0025222 0.0136417 0.0254246 -0.0036326 0.0174749 0.1332128 -0.0023157 0.0038741 0.0470498 -0.0361777 0.0327206 -0.0410395 -0.0150914 0.0105656 -0.0148779 -0.0175175 0.0516357 -0.0099956 0.0065316 -0.043153 0.0691132 -0.0334447 0.0395976 unknown
polarizability: 102.9064443|-11.7060467|86.4307046|-3.4879063|-3.2209431|86.8903188 unknown
InChI: InChI=1S/C4H3Cl5/c5-1-2(6)3(7)4(8)9/h2H,1H2
charge 0 multiplicity 1
12 atoms
Cl 1.549869 -1.719705 -1.410489
Cl 1.883642 2.062792 0.995424
Cl -0.110804 -1.285459 1.708813
Cl -3.0057 -0.188102 0.703045
Cl -1.732927 1.075646 -1.713567
C  1.005369 -0.071263 -0.558675
C  2.217962 0.35221 0.26529
C  -0.266695 -0.308335 0.189808
C  -1.497219 0.121629 -0.199617
H  0.837333 0.612021 -1.403056
H  2.407035 -0.317902 1.114174
H  3.106036 0.459869 -0.37105
