program: Gaussian 09
title: 000040574
version: EM64L-G09RevD.01
frameworkgroup: C1[X(C18H25NO3)]
method: RPBEPBE
basis: SDD
operation: Freq
keyword: #p
keyword: freq=noraman
keyword: PBEPBE/SDD
title: #p freq=noraman PBEPBE/SDD
converged: YES YES NO NO
title: Mulliken charges:
elementType: O O O N C C C C C C C C C C C C C C C C C C H H H H H H H H H H H H H H H H H H H H H H H H H
charge: -0.298609 -0.319071 -0.305334 -0.150360 0.275007 -0.211052 -0.188207 -0.431587 -0.433874 -0.442923 -0.434096 -0.428519 0.421645 0.308410 -0.372498 -0.412769 -0.539701 -0.253902 -0.259067 -0.241967 -0.205065 -0.677992 0.206977 0.221424 0.212049 0.193275 0.196304 0.228750 0.250846 0.237636 0.240528 0.253365 0.197889 0.234840 0.236119 0.235758 0.229880 0.229674 0.200391 0.227088 0.226907 0.230365 0.222775 0.226115 0.210188 0.227087 0.225299
chargesum: 0.00000
title: Mulliken charges with hydrogens summed into heavy atoms:
elementType: O O O N C C C C C C C C C C C C C C C C C C
charge: -0.298609 -0.319071 -0.305334 -0.150360 0.275007 -0.004075 0.033217 -0.026264 -0.008820 0.045559 0.059797 0.004209 0.421645 0.308410 -0.136379 -0.177011 0.120244 -0.026814 -0.032159 -0.011602 0.243826 -0.015417
polarizability: 2.35698886e+02 1.86367255e+01 1.92815001e+02 -8.04865713e+00 5.96641472e+00 1.81057941e+02
1716.lowfreq: -7.9505 -0.0005 0.0006 0.0007 7.0212 15.6112 25.3035 45.1990 50.1039
frequency: 24.6543 44.9417 50.0300 73.0817 77.6349 95.3714 102.1826 116.8665 131.1083 156.0064 166.4698 189.0586 220.3833 235.8070 251.5002 263.9637 282.0981 291.8266 297.0285 315.4673 328.3115 351.6142 379.1852 404.0236 407.0479 430.3234 471.1547 481.2174 512.2740 556.6085 573.1361 614.5188 626.5185 650.6139 664.8998 693.7874 706.0573 758.1405 767.2838 784.3684 801.1477 813.2675 821.4477 841.6266 853.2261 864.5406 892.0878 902.7912 925.9419 954.6784 964.9259 973.2318 979.3619 989.5589 991.8056 997.0925 1000.9957 1013.9122 1030.5601 1031.6531 1055.4410 1076.5741 1089.9673 1103.9687 1109.6500 1117.0219 1120.6108 1121.4082 1139.4997 1156.5974 1163.2804 1173.3458 1192.4150 1200.7631 1207.7825 1220.8578 1232.3997 1246.4023 1261.3975 1262.5106 1288.7561 1293.4233 1312.2923 1324.8247 1335.8947 1340.5167 1350.2360 1357.7764 1362.4911 1367.9527 1376.2211 1380.0775 1397.3479 1409.8685 1433.1041 1433.6735 1456.7831 1461.9698 1463.0364 1465.1973 1477.3031 1477.7599 1479.3283 1483.0700 1483.7742 1486.4987 1491.7336 1587.4366 1609.3213 1635.4116 2944.7872 2961.7829 2970.7688 2978.6954 2985.0601 2990.7674 2992.5919 3002.4485 3007.3752 3018.3566 3026.7046 3033.2719 3050.3853 3064.0644 3071.3081 3077.3538 3089.3617 3091.0709 3097.2110 3102.9093 3123.1754 3130.7536 3145.6900 3152.1129 3165.4308
redmass: 4.3552 3.6834 2.8161 3.3775 3.5321 4.8757 2.3778 3.0153 2.6639 2.5603 3.0028 1.9768 2.9812 3.2571 1.2181 4.0841 3.4128 3.3352 3.6006 4.2905 2.5145 3.8504 2.4082 2.9244 2.4489 3.1046 3.3506 3.7128 3.2748 3.9414 3.4369 6.2711 3.8749 4.9263 5.3799 10.6915 1.5955 5.1402 2.1743 2.2405 1.0951 2.7022 2.7356 2.8356 1.2691 1.5620 2.7682 3.1365 1.6083 2.3116 2.0452 1.8243 1.7766 2.1706 5.1028 1.3898 3.6407 5.0497 2.6405 2.1478 3.7731 1.8248 1.5122 1.8625 2.0712 1.4623 1.8272 1.4687 1.4597 1.4017 1.5235 1.0649 1.6159 1.7041 1.6457 1.7573 2.5819 1.1348 1.3441 1.4058 1.7841 1.7496 1.3800 1.3618 1.5254 1.3672 1.3762 1.3303 1.4170 1.3627 3.6800 1.6301 1.3247 2.3129 2.0395 1.1786 1.0815 1.0533 1.0412 1.0805 1.0524 1.0732 1.0589 1.1703 1.8669 1.0883 1.0803 5.8810 6.0173 10.0258 1.0343 1.0690 1.0719 1.0659 1.0666 1.0703 1.0359 1.0676 1.0583 1.0832 1.1004 1.0997 1.0987 1.1064 1.0988 1.0930 1.0985 1.0925 1.0990 1.1026 1.0844 1.0875 1.0916 1.0951 1.1011
irintensity: 0.0405 0.1505 0.3774 1.0588 0.4757 2.2726 0.9058 5.1979 1.3229 0.4195 1.3708 0.4560 3.8034 2.0502 1.0972 2.7406 4.6594 10.6904 1.3267 1.7892 1.2361 8.4593 13.0066 0.3790 2.1375 1.0032 0.2546 8.1716 3.9634 21.4203 1.9952 0.1345 2.0113 1.4581 4.0035 16.0549 58.7008 25.9409 26.1467 31.0187 2.8685 1.3069 0.8236 3.3211 0.2128 0.2167 6.4259 6.4746 13.8987 55.0865 2.2921 10.8940 12.7540 2.7390 2.8825 1.1431 9.1171 120.1837 3.4515 3.4432 203.9785 6.9503 4.5400 43.7448 4.5670 11.5390 85.6795 0.8982 4.5953 4.2442 0.5360 0.1473 21.4547 15.0160 18.7197 169.1304 92.2421 0.5052 5.0752 19.6429 20.1700 23.8057 0.6305 2.3129 41.6144 14.1952 5.8527 0.4503 1.5835 10.7873 3.1385 17.1508 58.7026 81.6335 10.5155 2.4123 7.2395 5.1290 12.5773 12.2568 8.5602 21.5071 8.3127 17.9589 13.4713 18.8308 7.5283 1.8891 3.1402 431.3416 58.7241 34.4289 5.7646 31.9152 19.8614 121.2846 28.1544 81.8379 30.1812 28.6049 61.7661 8.1020 4.9167 8.0042 69.1285 5.4997 36.3587 8.0601 25.8188 48.0259 2.5118 2.7634 25.2415 36.7371 16.6655
temp: 298.150 k
press: 1.00000 atm
elementType: 8 8 8 7 6 6 6 6 6 6 6 6 6 6 6 6 6 6 6 6 6 6 1 1 1 1 1 1 1 1 1 1 1 1 1 1 1 1 1 1 1 1 1 1 1 1 1
symmnumber: 1
zpe: 1049955.4 jmol-1
zpe.correction: 0.399907 hartree
zpe.thermalcorrener: 0.420920 hartree
zpe.thermalcorrenthalpy: 0.421864 hartree
zpe.thermalcorrgfe: 0.350103 hartree
zpe.sumelectzpe: -979.658185 hartree
zpe.sumelectthermal: -979.637172 hartree
zpe.sumelectthermalent: -979.636228 hartree
zpe.sumelectthermalfe: -979.707988 hartree
dipole: -1.7063 -0.5609 -3.1835
dipole: 3.6552
quadrupole: -123.2043 -129.4169 -131.0800
quadrupole: 3.4658 -8.8223 1.5799
quadrupole: 4.6961 -1.5165 -3.1796 3.4658 -8.8223 1.5799
hfenergy: -980.0580917 hartree
pointgroup: C01 [X(C18H25N1O3)]
dipole: -0.6621844 -0.2345689 -1.2548189 debye
polarizability: 236.0948234|18.1629956|192.7325728|-7.8082692|6.0039021|180.7444312 unknown
InChI: InChI=1S/C18H25NO3/c1-3-22-17(20)19-12-15-10-7-11-16(13-19)18(15,21-2)14-8-5-4-6-9-14/h4-6,8-9,15-16H,3,7,10-13H2,1-2H3
charge 0 multiplicity 1
47 atoms
O  -2.107298 2.004726 -0.294521
O  3.565246 -0.79191 -0.352998
O  3.259774 -0.53508 1.964894
N  1.469645 -0.273781 0.464895
C  -1.207855 0.817675 -0.11869
C  -0.089136 0.790912 -1.210915
C  -0.480448 1.104955 1.231878
C  0.574275 2.192434 -1.322018
C  0.205893 2.499346 1.2001
C  0.9461 -0.335199 -0.916295
C  0.492784 -0.056326 1.554104
C  1.182757 2.693653 0.012162
C  -2.109337 -0.435404 -0.070156
C  2.781636 -0.532895 0.795223
C  -3.011759 -0.594261 1.016394
C  -2.171797 -1.38575 -1.121449
C  -2.927433 2.008678 -1.507229
C  -3.915035 -1.676363 1.068193
C  -3.076223 -2.47163 -1.077805
C  -3.947858 -2.627957 0.021704
C  5.002121 -1.062361 -0.072629
C  5.658396 -1.370418 -1.415537
H  -0.528872 0.550029 -2.200347
H  -1.231641 1.123357 2.043856
H  -0.192965 2.915063 -1.65807
H  1.355206 2.158971 -2.107584
H  0.742402 2.654171 2.157015
H  -0.591328 3.261287 1.140931
H  1.795602 -0.246026 -1.610435
H  0.483246 -1.328757 -1.081612
H  -0.084002 -0.989091 1.725624
H  1.06323 0.159253 2.472406
H  1.431372 3.768742 -0.08253
H  2.133268 2.16986 0.213125
H  -3.025381 0.150836 1.81848
H  -1.522389 -1.282953 -1.996585
H  -3.52844 2.930293 -1.447288
H  -3.602334 1.131649 -1.552788
H  -2.311475 2.039044 -2.429964
H  -4.597809 -1.77424 1.919878
H  -3.09961 -3.191617 -1.903761
H  -4.647418 -3.47034 0.060005
H  5.441785 -0.173954 0.416386
H  5.071122 -1.90914 0.633955
H  6.732288 -1.585842 -1.265774
H  5.190412 -2.250443 -1.8897
H  5.56948 -0.513596 -2.105726
