program: Gaussian 09
title: 000040526
version: EM64L-G09RevD.01
frameworkgroup: C1[X(C16H14O3S)]
method: RPBEPBE
basis: SDD
operation: Freq
keyword: #p
keyword: freq=noraman
keyword: PBEPBE/SDD
title: #p freq=noraman PBEPBE/SDD
converged: YES YES NO NO
title: Mulliken charges:
elementType: S O O O C C C C C C C C C C C C C C C C H H H H H H H H H H H H H H
charge: 0.211772 -0.249840 -0.407207 -0.236627 -0.558814 0.567643 0.507385 -0.326801 -0.433773 -0.356993 -0.445167 -0.371774 -0.363578 0.495987 -0.691984 -0.273264 -0.370265 0.178658 -0.241948 -0.206331 0.291797 0.248038 0.236221 0.258890 0.237882 0.264897 0.230768 0.243422 0.224009 0.243925 0.254989 0.229624 0.231252 0.377205
chargesum: 0.00000
title: Mulliken charges with hydrogens summed into heavy atoms:
elementType: S O O O C C C C C C C C C C C C C C C C
charge: 0.211772 -0.249840 -0.030002 -0.236627 -0.267017 0.567643 0.507385 -0.078763 -0.197553 -0.098103 -0.207284 -0.106876 -0.363578 0.495987 0.006216 -0.029338 -0.115277 0.178658 -0.012324 0.024921
polarizability: 3.01967683e+02 6.37349058e+00 1.63810166e+02 -2.35241267e+01 -7.09298611e+00 1.44547434e+02
1716.lowfreq: -2.6152 -0.3969 -0.0012 0.0015 0.0020 9.8712 19.8792 29.1843 31.2811
frequency: 19.7849 29.1646 31.1920 45.3272 52.9193 90.1519 128.0116 158.6325 176.1660 200.3681 213.4591 232.7339 257.6106 268.8608 324.1370 345.6433 370.0996 404.7399 418.6541 425.1093 460.8738 498.7351 528.8510 534.0399 573.0043 584.9891 603.9153 628.6190 632.1786 663.0001 678.8602 703.0843 713.4536 748.4932 751.3893 781.8253 805.8890 823.5108 836.6043 849.7067 852.6070 865.6651 927.1435 942.8529 962.5544 970.4000 986.2653 993.3507 1015.0951 1017.6245 1032.4408 1035.2728 1070.8489 1094.2542 1115.9598 1127.3866 1161.8657 1179.4222 1192.5358 1200.8319 1210.9045 1234.0289 1238.5631 1263.1170 1274.8480 1304.2799 1336.0561 1351.5755 1386.3503 1392.2282 1393.9658 1418.2063 1434.1825 1448.1521 1469.8463 1475.3644 1506.1913 1584.0548 1587.3874 1597.5814 1621.2749 1659.8930 2995.4183 3018.5053 3048.1609 3093.2913 3108.4411 3119.6621 3137.9293 3138.4043 3143.5574 3151.6823 3165.8222 3165.8724 3177.5554 3504.5655
redmass: 5.9039 5.8645 6.0382 7.0662 4.5206 7.5179 5.0313 5.6432 5.5495 4.0767 1.0967 4.1286 4.2969 5.7748 6.0005 5.3955 6.9897 2.9724 4.8046 3.2228 9.4462 4.4869 4.6180 4.1870 4.1042 4.0388 3.0952 5.9733 1.7377 5.8069 5.4495 3.8828 3.9933 3.4753 1.2730 3.6996 4.6305 3.2844 3.2354 1.3912 1.4569 1.6844 1.4018 5.2322 1.4531 1.3089 1.5381 1.8119 2.8089 2.6520 3.8529 2.5831 1.5713 2.3029 1.5002 1.4742 1.2242 1.3570 1.2057 1.9518 1.8064 2.0855 1.6015 1.4520 1.5178 1.6665 1.4770 1.6704 6.5509 1.4371 2.9499 2.3892 2.3048 2.8006 1.0533 1.0532 2.5798 6.8920 6.6664 7.2449 6.2616 8.1556 1.0352 1.0878 1.0852 1.1003 1.1004 1.0877 1.0855 1.0893 1.0964 1.0908 1.0957 1.0957 1.0995 1.0639
irintensity: 0.1432 0.3730 1.2334 1.2346 0.6018 0.3098 2.1429 0.3432 1.4678 3.2404 0.6599 3.3533 2.7451 1.8810 0.2097 0.9169 6.1804 2.7096 11.7589 5.8071 1.2231 21.6438 12.0229 3.0516 10.7265 25.2285 34.3474 14.5097 72.6060 15.9731 30.4697 80.7812 5.1670 0.6140 100.8999 0.5842 16.2166 9.5492 26.3746 2.4231 6.6785 17.0567 7.9631 98.1105 3.9436 0.1692 2.7024 4.4475 15.6615 29.8362 33.4476 235.6463 25.2476 52.9998 18.3956 10.7404 17.9638 30.0459 7.2500 2.9122 48.9058 125.3698 0.0468 14.5026 4.2876 23.3876 20.9280 25.8249 11.4360 16.9610 14.7567 27.2359 7.2139 114.1668 9.3513 12.8169 15.9976 10.3095 1.2394 3.4122 17.8961 178.7360 27.3923 28.0022 7.1130 37.0884 16.1204 11.6904 0.9658 4.0554 18.6896 11.1162 11.6428 9.2475 13.8808 23.7710
temp: 298.150 k
press: 1.00000 atm
elementType: 16 8 8 8 6 6 6 6 6 6 6 6 6 6 6 6 6 6 6 6 1 1 1 1 1 1 1 1 1 1 1 1 1 1
symmnumber: 1
zpe: 678851.4 jmol-1
zpe.correction: 0.258561 hartree
zpe.thermalcorrener: 0.276467 hartree
zpe.thermalcorrenthalpy: 0.277411 hartree
zpe.thermalcorrgfe: 0.209825 hartree
zpe.sumelectzpe: -1240.419313 hartree
zpe.sumelectthermal: -1240.401406 hartree
zpe.sumelectthermalent: -1240.400462 hartree
zpe.sumelectthermalfe: -1240.468049 hartree
dipole: -0.4429 -0.2261 1.7066
dipole: 1.7776
quadrupole: -105.0495 -120.0583 -123.4032
quadrupole: 3.9927 -8.3972 2.3914
quadrupole: 11.1208 -3.8879 -7.2329 3.9927 -8.3972 2.3914
hfenergy: -1240.6778734 hartree
pointgroup: C01 [X(C16H14O3S1)]
dipole: -0.1759823 -0.6687636 -0.1042515 debye
polarizability: 302.1663977|23.8247639|144.2307577|3.0413522|5.8151834|163.9281272 unknown
InChI: InChI=1S/C16H14O3S/c1-10(15(17)18)11-6-8-12(9-7-11)16-19-13-4-2-3-5-14(13)20-16/h2-10,16-17H,1H3
charge 0 multiplicity 1
34 atoms
S  2.03197 -0.060562 -1.81858
O  2.084034 -0.404504 0.913958
O  -5.491447 0.697729 -1.53983
O  -4.865229 2.1780 0.134659
C  1.335769 -0.964091 -0.221586
C  -0.141921 -0.769601 -0.04298
C  -2.951443 -0.419163 0.241508
C  -4.467278 -0.256717 0.433842
C  -1.033317 -1.801022 -0.420647
C  -0.662726 0.440826 0.479146
C  -2.427549 -1.622852 -0.286773
C  -2.052225 0.611151 0.625959
C  3.554061 0.272457 -0.860573
C  3.371437 0.030698 0.524397
C  -4.850761 -0.184941 1.935171
C  4.781461 0.769179 -1.332879
C  4.391159 0.270063 1.456651
C  -4.942986 1.003129 -0.287054
C  5.823836 1.01345 -0.400754
C  5.629686 0.76705 0.977728
H  1.612163 -2.026404 -0.348272
H  -4.972911 -1.11487 -0.040755
H  -0.640903 -2.743774 -0.821385
H  0.029247 1.235218 0.775157
H  -3.11041 -2.424977 -0.589945
H  -2.447499 1.552021 1.025574
H  -4.477991 -1.08038 2.461159
H  -4.410826 0.709605 2.406796
H  -5.94712 -0.133185 2.060258
H  4.933532 0.964585 -2.398831
H  4.219504 0.073184 2.518617
H  6.786154 1.393528 -0.759099
H  6.442188 0.955515 1.687168
H  -5.752356 1.542352 -1.999704
