program: Gaussian 09
title: 000040495
version: EM64L-G09RevD.01
frameworkgroup: C1[X(C7H16O3)]
method: RPBEPBE
basis: SDD
operation: Freq
keyword: #pfreq=noraman
keyword: PBEPBE/SDD
title: #p freq=noraman PBEPBE/SDD
converged: YES YES NO NO
title: Mulliken charges:
elementType: O O O C C C C C C C H H H H H H H H H H H H H H H H
charge: -0.297977 -0.280887 -0.310443 -0.099278 0.384023 -0.711928 -0.707899 -0.527013 -0.530642 -0.502575 0.214633 0.230374 0.212171 0.220660 0.240832 0.198998 0.231947 0.225717 0.240559 0.215517 0.216444 0.236863 0.227898 0.235684 0.220205 0.216117
chargesum: 0.00000
title: Mulliken charges with hydrogens summed into heavy atoms:
elementType: O O O C C C C C C C
charge: -0.297977 -0.280887 -0.310443 0.115355 0.384023 -0.048724 -0.036121 0.154780 0.150564 0.169431
polarizability: 9.00153188e+01 7.24623231e-01 8.65955539e+01 8.47692071e-01 -1.24285816e-01 8.40613715e+01
1716.lowfreq: -15.2168 -5.3296 -0.0014 -0.0012 -0.0008 18.9298 75.0206 92.1742 115.4963
frequency: 74.9153 92.1730 115.4442 123.0780 155.5896 170.6317 174.6227 196.4640 199.9972 223.2411 227.4001 247.1748 284.6081 320.5780 347.3898 395.1926 447.7526 496.5408 538.4843 593.1986 656.3234 884.0439 892.1081 906.5758 937.9356 964.1607 991.2724 995.4874 1016.0792 1076.6568 1110.1627 1114.2174 1119.3560 1134.2690 1136.6025 1149.3761 1157.3251 1177.3876 1226.2546 1305.9864 1335.6790 1376.9723 1396.1731 1417.5728 1426.8667 1432.9502 1451.6872 1459.9637 1460.5835 1463.6197 1472.5319 1474.4986 1480.2402 1482.4037 1490.2852 1498.7874 2964.5613 2967.9096 2984.4694 2985.3160 2989.2402 2995.8896 3058.1438 3062.9978 3079.3590 3081.0542 3084.7863 3087.1700 3106.0345 3108.2388 3111.3610 3113.6226
redmass: 2.4496 2.7556 2.6147 2.1086 1.1211 1.5892 1.1311 1.6232 1.1127 2.3572 1.7349 1.6946 3.7460 2.7693 3.6071 4.3811 2.8936 5.1809 4.6388 3.1730 4.9076 2.8191 2.9648 2.7727 1.3505 1.7496 4.1247 8.1580 7.8648 2.5646 1.2500 1.2709 1.2922 1.4336 2.1297 1.3900 1.5431 1.9472 2.5779 1.4539 1.5388 1.2088 1.2105 1.1267 1.1396 1.1326 1.0546 1.0535 1.0478 1.0565 1.0490 1.0483 1.0475 1.0512 1.0514 1.0595 1.0328 1.0320 1.0300 1.0351 1.0384 1.0796 1.1009 1.1024 1.1001 1.1026 1.0990 1.0993 1.1000 1.1020 1.1042 1.1017
irintensity: 2.9991 3.8682 6.3911 2.7229 0.9096 0.6495 1.1651 4.2896 0.5639 0.3903 4.7765 1.8901 18.3466 1.8563 3.4120 7.9813 1.4131 14.6423 4.4034 0.8687 0.6984 2.5774 59.2275 70.5230 36.4907 1.6234 26.8794 166.2261 211.4055 164.1352 5.7783 1.5561 3.5183 10.7679 2.8060 3.4032 4.0303 5.4157 38.3424 0.5751 9.3380 18.4236 27.1124 6.7918 3.4442 11.5302 5.9682 7.5634 3.1108 3.9741 8.4140 15.8702 6.4859 8.9192 16.1396 17.8572 64.8052 41.4242 64.1785 35.4389 38.1502 17.1889 36.2246 39.7599 9.2373 50.3141 51.6489 40.8061 24.9239 24.8217 31.8080 21.4657
temp: 298.150 k
press: 1.00000 atm
elementType: 8 8 8 6 6 6 6 6 6 6 1 1 1 1 1 1 1 1 1 1 1 1 1 1 1 1
symmnumber: 1
zpe: 587827.2 jmol-1
zpe.correction: 0.223892 hartree
zpe.thermalcorrener: 0.237349 hartree
zpe.thermalcorrenthalpy: 0.238293 hartree
zpe.thermalcorrgfe: 0.185413 hartree
zpe.sumelectzpe: -501.116511 hartree
zpe.sumelectthermal: -501.103054 hartree
zpe.sumelectthermalent: -501.102110 hartree
zpe.sumelectthermalfe: -501.154989 hartree
dipole: -1.3360 1.3410 0.3532
dipole: 1.9256
quadrupole: -57.7073 -60.3504 -62.3010
quadrupole: 1.8675 -0.2898 -2.4709
quadrupole: 2.4122 -0.2309 -2.1814 1.8675 -0.2898 -2.4709
hfenergy: -501.3404027 hartree
pointgroup: C01 [X(C7H16O3)]
dipole: -0.4330629 0.5613515 0.2669743 debye
dipolederiv: -0.5487755 0.1145463 0.0358416 -0.0954556 -1.1808299 -0.1464481 -0.101699 -0.193882 -0.5783001 -0.9713927 -0.0009224 -0.3772152 -0.0147967 -0.5256476 0.0454463 -0.3169033 -0.0860667 -0.7850685 -0.6803893 -0.1791528 0.26745 -0.1693795 -0.6796491 0.3650439 0.1728362 0.2208036 -0.8690934 -0.0433903 0.026243 0.0102797 0.0284783 0.0249292 -0.0083756 -0.0018409 -0.0549336 0.0183749 1.0954646 -0.1222818 0.110348 0.1349947 1.2794798 -0.2732346 0.3904511 0.2392141 1.2969095 -0.0163391 0.0120854 -0.0721978 0.0030002 0.0506979 -0.0284874 -0.0307993 -0.0137427 -0.059028 0.0317703 0.0494649 0.002342 -0.003596 -0.0024446 -0.0438051 -0.0354407 -0.0633619 -0.0103679 0.3261494 0.0786915 0.0345047 0.05423 0.6333082 0.0493088 0.0155725 -0.1384379 0.1846322 0.5601994 0.0408022 0.1592079 0.0609597 0.2827304 0.0369479 -0.0046458 0.020736 0.2068321 0.4217973 0.1104852 -0.1950436 0.0368605 0.2761927 -0.0312751 -0.2121588 -0.152265 0.5582676 0.0456829 -0.0344468 0.0209821 -0.0309096 -0.1186888 0.0896371 -0.0036139 0.093682 -0.0058616 0.1048102 -0.0593158 0.0301422 -0.013023 -0.0721652 0.1171173 0.0020932 0.0686852 0.0221736 -0.2005506 0.0019014 0.0186715 0.0004526 0.0969973 0.0079587 0.0605843 0.0064599 0.0676062 0.1121727 0.0446019 0.0369255 0.0194868 -0.0699884 -0.1301583 0.0190008 -0.1165298 -0.0277997 0.0793912 -0.0156302 -0.1208945 -0.0143774 0.0836133 0.0048312 -0.0933774 -0.0199926 -0.093498 -0.2107182 0.0380736 0.0878594 0.0036123 0.0627261 -0.0167445 0.0510981 -0.0242442 0.0771708 0.1047424 -0.0528051 0.0168915 -0.0243086 -0.0760507 0.05502 0.0128298 0.1114174 0.0423033 0.0303903 0.0960384 0.0815649 0.0499565 -0.0548135 -0.0692163 0.0762638 -0.1107118 0.0262312 0.0587511 -0.0058815 -0.0573136 -0.0017158 0.0488479 0.0136683 -0.0543664 0.1259134 -0.0899244 -0.1833518 -0.125729 -0.027399 -0.0455519 -0.0006695 0.0092503 -0.0177202 0.0358808 0.0743251 -0.0561017 0.0454454 0.0254854 0.0718128 -0.0178776 -0.0961226 0.1355866 -0.104328 -0.000548 -0.0065577 -0.0386106 -0.0143209 -0.1107693 -0.1228968 0.0185649 0.0594084 0.057538 0.1043565 0.0229892 0.0044525 -0.0696765 0.0205245 0.1020724 0.0599434 -0.1108549 0.0468827 -0.1129682 0.0196736 -0.0547357 -0.0691999 -0.0224639 0.069843 -0.1196638 -0.0278216 -0.0398707 -0.1141882 0.0792476 -0.0311222 0.0406208 -0.0640684 -0.1432853 0.095533 0.0359791 0.0452704 0.051722 -0.1756651 0.057802 0.0241436 0.1260469 0.0535688 -0.0047395 -0.0204617 0.0458834 0.0157408 unknown
polarizability: 90.0223354|-0.2185325|86.4290074|1.2029618|0.3433628|84.2209013 unknown
InChI: InChI=1S/C7H16O3/c1-6(2)7(8-3,9-4)10-5/h6H,1-5H3
charge 0 multiplicity 1
26 atoms
O  -0.4839 1.082931 0.770635
O  -0.761869 0.190732 -1.435182
O  -0.508422 -1.229785 0.478788
C  1.416933 -0.052548 -0.452662
C  -0.101461 0.004386 -0.149972
C  2.229423 -0.093376 0.859943
C  1.752592 -1.257735 -1.360458
C  -0.182798 2.439895 0.294503
C  -2.221601 0.012556 -1.412703
C  -1.390302 -1.182964 1.658213
H  1.660767 0.875755 -1.007274
H  2.012472 -1.025465 1.412059
H  3.311674 -0.068773 0.637536
H  1.990469 0.757996 1.521877
H  1.196441 -1.201526 -2.310772
H  2.8357 -1.274565 -1.582573
H  1.48357 -2.202098 -0.855973
H  -0.756894 3.115863 0.947891
H  -0.498031 2.566464 -0.757312
H  0.896776 2.668327 0.388862
H  -2.698537 0.698903 -0.68636
H  -2.47776 -1.033435 -1.164974
H  -2.561458 0.251084 -2.432343
H  -0.905482 -0.656974 2.49801
H  -1.553309 -2.243265 1.910286
H  -2.356192 -0.692883 1.439655
