program: Gaussian 09
title: 000040499
version: EM64L-G09RevD.01
frameworkgroup: C1[X(C14H14Cl2O4)]
method: RPBEPBE
basis: SDD
operation: Freq
keyword: #p
keyword: freq=noraman
keyword: PBEPBE/SDD
title: #p freq=noraman PBEPBE/SDD
converged: YES YES NO NO
title: Mulliken charges:
elementType: Cl Cl O O O O C C C C C C C C C C C C C C H H H H H H H H H H H H H H
charge: 0.049983 0.051489 -0.168659 -0.217203 -0.424218 -0.176719 -0.168415 -0.613445 -0.057762 0.391599 -0.009040 0.270213 -0.728595 -0.713143 -0.578170 -0.291916 0.517138 -0.410118 -0.337519 0.162615 0.252610 0.241115 0.241200 0.237251 0.214144 0.220973 0.214233 0.195655 0.218826 0.244344 0.266046 0.255198 0.255043 0.395247
chargesum: 0.00000
title: Mulliken charges with hydrogens summed into heavy atoms:
elementType: Cl Cl O O O O C C C C C C C C C C C C C C
charge: 0.049983 0.051489 -0.168659 -0.217203 -0.028971 -0.176719 0.084195 -0.131129 0.179488 0.391599 -0.009040 0.270213 -0.079246 -0.054319 -0.312124 -0.291916 0.517138 -0.410118 0.172723 0.162615
polarizability: 2.65697562e+02 4.01568078e+00 2.08100633e+02 6.23189285e+00 6.31998892e+00 1.01055611e+02
1716.lowfreq: -8.3182 -1.0951 0.0001 0.0012 0.0017 4.5793 20.8897 28.9782 31.2963
frequency: 20.8586 28.8215 31.2592 59.8813 61.0033 74.4134 88.6300 123.6252 128.9881 166.7804 183.0925 193.8767 200.1088 207.0528 233.9932 235.0793 245.0107 261.6281 297.1133 322.2231 331.4097 376.4863 396.0324 420.4281 471.1686 501.0351 512.6901 539.8206 549.3284 571.5780 596.0458 604.1061 628.6390 632.0926 674.2590 700.0699 743.5663 802.1752 810.9630 849.1247 852.2692 879.5780 910.6649 916.9306 955.3197 958.9562 974.4579 1004.2033 1010.2182 1033.1839 1047.7776 1069.1805 1095.8029 1138.4864 1149.3176 1167.6799 1192.2995 1199.5543 1205.6585 1223.8948 1252.6873 1263.6565 1284.7095 1288.4212 1316.1388 1348.1300 1365.7935 1380.9532 1384.0258 1398.2537 1400.4444 1431.3297 1450.2486 1456.1954 1466.3940 1477.5702 1485.4132 1487.5947 1561.5615 1590.9017 1632.7866 1710.5837 2964.6764 2967.9986 2973.5063 2976.2365 2991.5448 2994.8984 3034.6066 3046.1176 3058.1556 3066.2615 3070.6399 3081.3356 3157.9568 3528.9450
redmass: 11.4582 4.4982 7.1250 5.7727 4.3624 5.7578 4.5508 4.9323 3.0591 5.6641 3.7217 8.0088 19.1616 1.3586 3.7467 2.0971 1.8125 3.2007 3.2211 12.9833 6.1434 3.4196 4.7730 5.0711 5.7271 3.8865 1.8321 3.5963 4.1933 5.3269 4.5050 7.1005 1.5140 4.3592 7.0352 6.8206 4.2233 3.5009 5.2013 1.7862 4.9122 4.0328 2.2139 1.2012 1.7946 3.4626 2.0329 1.8758 2.0879 3.2664 2.9719 4.0046 2.0901 5.6181 1.8487 1.3746 1.6603 1.6854 1.0777 1.3936 1.6974 1.5799 1.9626 4.0288 1.5109 1.3903 2.4326 1.2154 5.5707 2.6034 1.4606 2.4420 1.0902 1.3261 1.0480 1.0593 1.0530 1.0494 8.4337 8.2137 12.0282 9.5074 1.0806 1.0360 1.0554 1.0380 1.0822 1.0623 1.1045 1.1003 1.0989 1.0983 1.0986 1.0996 1.0912 1.0644
irintensity: 0.8329 0.1494 0.1860 0.7414 0.4639 1.3404 0.7777 0.4114 10.8124 0.1841 2.1157 0.1520 0.1628 0.3540 0.5905 0.0995 0.4323 1.1870 3.0641 0.1419 0.5326 3.2066 3.0426 13.5869 13.0547 7.0054 42.1937 2.7887 1.1888 29.5252 3.2729 14.6009 133.5839 19.7742 2.6522 40.3384 5.5001 0.9420 0.4107 26.5218 31.0476 2.0894 6.8886 4.2303 30.9942 49.8869 8.6741 0.2439 29.3329 462.1859 5.9872 1.6838 12.0180 146.6052 9.9875 25.7455 13.5918 16.5648 0.9758 0.8982 163.1927 22.7886 26.6055 183.5011 17.0970 3.3472 0.7295 24.0781 49.8201 83.0238 21.7955 60.3320 15.0066 11.2629 0.9287 6.8822 18.3232 21.6215 53.1458 409.5245 103.7017 197.3533 13.9377 35.4185 36.4045 15.9185 11.0169 15.3752 11.9569 13.8943 18.9767 45.0366 66.5295 36.9914 10.0090 45.1856
temp: 298.150 k
press: 1.00000 atm
elementType: 17 17 8 8 8 8 6 6 6 6 6 6 6 6 6 6 6 6 6 6 1 1 1 1 1 1 1 1 1 1 1 1 1 1
symmnumber: 1
zpe: 659181.6 jmol-1
zpe.correction: 0.251069 hartree
zpe.thermalcorrener: 0.271327 hartree
zpe.thermalcorrenthalpy: 0.272271 hartree
zpe.thermalcorrgfe: 0.199521 hartree
zpe.sumelectzpe: -1761.418550 hartree
zpe.sumelectthermal: -1761.398292 hartree
zpe.sumelectthermalent: -1761.397348 hartree
zpe.sumelectthermalfe: -1761.470098 hartree
dipole: 1.2250 -7.9727 -0.4750
dipole: 8.0803
quadrupole: -129.0963 -129.6031 -128.5575
quadrupole: -5.7450 -0.9039 1.0118
quadrupole: -0.0106 -0.5175 0.5281 -5.7450 -0.9039 1.0118
hfenergy: -1761.6696192 hartree
pointgroup: C01 [X(C14H14Cl2O4)]
dipole: -0.5223514 3.1299915 -0.1910666 debye
polarizability: 265.7910559|5.1031688|208.2887045|-0.3841731|-5.7556605|100.774045 unknown
InChI: InChI=1S/C14H14Cl2O4/c1-6(2)8-3-7-4-9(20-5-10(17)18)12(15)13(16)11(7)14(8)19/h4,6,8,17H,3,5H2,1-2H3
charge 0 multiplicity 1
34 atoms
Cl 0.892216 -3.631284 -0.031636
Cl -2.288922 -2.987443 0.069104
O  3.498292 -1.831613 -0.219993
O  -2.933747 -0.167819 -0.089525
O  -5.490773 2.401144 -0.177172
O  -5.697407 0.078767 -0.061063
C  3.165184 0.611349 -0.552707
C  1.886443 1.476165 -0.370053
C  4.413522 0.996439 0.294297
C  0.743217 0.474958 -0.284231
C  2.713414 -0.85303 -0.310542
C  1.223684 -0.857882 -0.227148
C  4.960174 2.379448 -0.128422
C  4.151311 0.933413 1.81769
C  -0.631929 0.75905 -0.240694
C  0.304714 -1.93023 -0.111248
C  -1.549183 -0.315789 -0.135103
C  -1.076919 -1.664029 -0.066714
C  -3.465963 1.185172 -0.170479
C  -4.986222 1.091516 -0.12632
H  3.474893 0.65229 -1.619092
H  1.737406 2.192987 -1.197754
H  1.937754 2.072585 0.561056
H  5.177353 0.227782 0.059605
H  4.226797 3.183009 0.077509
H  5.883146 2.62286 0.429293
H  5.19982 2.407294 -1.208304
H  3.401976 1.681305 2.141144
H  5.083472 1.144534 2.372748
H  3.798909 -0.067474 2.124514
H  -0.979895 1.794866 -0.285704
H  -3.122173 1.809005 0.678364
H  -3.167825 1.682611 -1.115032
H  -6.48534 2.379745 -0.155087
