program: Gaussian 09
title: 000040560
version: EM64L-G09RevD.01
frameworkgroup: C1[X(C16H32N2O4)]
method: RPBEPBE
basis: SDD
operation: Freq
keyword: #p
keyword: freq=noraman
keyword: PBEPBE/SDD
title: #p freq=noraman PBEPBE/SDD
converged: NO YES NO NO
title: Mulliken charges:
elementType: O O O O N N C C C C C C C C C C C C C C C C H H H H H H H H H H H H H H H H H H H H H H H H H H H H H H H H
charge: -0.446298 -0.430733 -0.451665 -0.495031 -0.138892 -0.082748 -0.140039 -0.134422 -0.135961 -0.136063 -0.441529 -0.404038 -0.356382 -0.357776 -0.353935 -0.364529 -0.397422 -0.400567 -0.398307 -0.392766 -0.400019 -0.397046 0.211624 0.266350 0.255986 0.264343 0.215763 0.232080 0.164278 0.237768 0.217889 0.181803 0.184458 0.225093 0.222550 0.165207 0.226023 0.165552 0.197961 0.209273 0.197845 0.212459 0.207001 0.191691 0.191206 0.207198 0.218917 0.191277 0.213439 0.187084 0.372682 0.337925 0.343577 0.339866
chargesum: 0.00000
title: Mulliken charges with hydrogens summed into heavy atoms:
elementType: O O O O N N C C C C C C C C C C C C C C C C
charge: -0.073617 -0.092808 -0.108088 -0.155165 -0.138892 -0.082748 0.071586 0.131928 0.120025 0.128280 0.006314 -0.001993 0.043310 0.051775 0.033822 0.027046 0.009813 0.009737 0.000386 0.005638 0.010175 0.003478
polarizability: 2.38301327e+02 7.06334998e+00 1.84539838e+02 -1.41747376e+00 -3.34001952e+00 1.71481518e+02
1716.lowfreq: -9.5980 -3.5648 -0.0004 -0.0002 0.0008 7.5649 20.4855 25.1004 29.6331
frequency: 19.6657 23.2143 26.8709 42.6064 53.5651 60.6311 77.8252 104.1072 112.7554 123.4335 144.0829 164.7998 212.6342 229.3370 245.1991 256.7342 263.2132 271.0697 282.3454 295.0797 304.1534 312.7917 324.3317 330.4184 344.6601 378.9349 404.5163 411.6990 444.4151 447.6778 449.0941 454.7512 466.9686 470.7244 494.1416 566.7165 571.9194 586.6673 650.2213 683.7052 742.1885 760.8237 776.9335 802.3349 804.4160 811.4853 836.8112 852.8104 855.6183 856.5418 857.3594 904.1395 905.3543 930.6329 943.8327 956.8968 957.7732 970.9196 981.3502 991.3868 996.7439 1021.7451 1042.2958 1045.5959 1050.3498 1055.0632 1071.2806 1073.1391 1093.5062 1105.7999 1114.2746 1118.8498 1121.1820 1124.0325 1149.8726 1150.6200 1151.3946 1152.8732 1163.8126 1180.7482 1199.1284 1215.4283 1230.8840 1244.0973 1255.3148 1264.6524 1266.1045 1267.7926 1272.8436 1279.1452 1292.2463 1293.7155 1304.6813 1311.3936 1320.1062 1327.7642 1330.9444 1334.1324 1340.7450 1341.2909 1343.7085 1345.4890 1351.8056 1352.9147 1364.3766 1368.7247 1374.7202 1382.9014 1386.7359 1390.4910 1393.6944 1403.3453 1449.5924 1453.8800 1454.0677 1457.7760 1459.7312 1462.7043 1465.1070 1469.4714 1470.1199 1475.5635 1479.8366 1488.6328 2794.5811 2814.6179 2830.5217 2852.8094 2862.6139 2910.2013 2966.3586 2969.6083 2981.3782 2986.0227 2986.6911 2986.8731 2987.2723 3024.1601 3029.1883 3031.9793 3033.9859 3034.4012 3037.0233 3040.6463 3043.0303 3046.5658 3046.6978 3047.7760 3055.7781 3055.9447 3057.3170 3077.3547 3289.9863 3496.7192 3520.3917 3565.7260
redmass: 4.4238 3.1027 4.2709 4.5142 3.7826 3.9997 4.6335 3.4756 5.2269 3.6781 3.4781 3.7841 4.3197 1.8774 2.1375 3.2371 2.4693 3.2820 2.5006 2.5699 3.2635 1.9098 2.8577 3.1079 2.0224 1.7859 2.0067 2.3384 1.4653 2.3332 2.8518 1.4296 2.3710 2.1638 3.3461 2.1418 1.9744 2.8577 3.2905 2.8608 1.5518 3.7895 2.0377 1.4768 1.4847 3.4047 3.1820 2.1092 2.3759 1.6227 1.6661 2.3968 2.4406 3.2551 2.5127 1.3048 1.3214 2.6581 3.5408 2.2889 2.5112 2.8815 2.3969 2.3344 2.2176 2.0303 1.6250 2.6449 1.6200 2.1304 2.4766 2.3393 2.5298 2.5390 2.0975 1.3344 1.2508 1.2096 2.2218 1.2378 1.3400 1.3757 1.3888 1.4813 1.2986 1.2705 1.2110 1.2449 1.3044 1.3453 1.3555 1.3768 1.2593 1.3347 1.2433 1.3073 1.2920 1.3292 1.4253 1.3754 1.4196 1.4618 1.4460 1.4544 1.4877 1.3385 1.4041 1.1869 1.2869 1.4474 1.3024 1.4907 1.0896 1.0942 1.0910 1.0820 1.0879 1.0862 1.0843 1.0959 1.0964 1.0771 1.0960 1.0967 1.0710 1.0712 1.0697 1.0716 1.0698 1.0692 1.0625 1.0633 1.0818 1.0616 1.0618 1.0605 1.0616 1.0893 1.0861 1.0927 1.0885 1.0884 1.0948 1.0885 1.0895 1.1029 1.0996 1.0905 1.1035 1.1036 1.0889 1.0859 1.0638 1.0647 1.0654 1.0660
irintensity: 0.7879 0.3211 0.4839 0.8355 0.1034 0.7074 3.0286 1.4091 3.6899 0.9186 2.2555 4.0909 6.9704 0.8381 1.4681 1.9570 4.1676 10.1949 8.0339 24.4567 4.3799 21.9477 21.1863 40.9672 13.2842 4.4297 10.7779 1.3507 77.9963 16.0045 3.9376 140.8084 9.6320 103.1022 36.3324 0.8674 6.9721 9.9222 13.1783 22.0136 105.4579 11.8048 18.6497 0.1034 0.0970 16.1310 57.2995 3.2577 4.9646 2.6602 8.7041 1.9970 1.0809 18.5323 42.5645 3.4995 0.9579 57.4556 59.8777 6.0890 11.1738 5.1355 16.4783 31.0947 6.6281 22.4939 24.3795 127.3153 11.0505 8.3916 13.4246 20.0880 5.4769 16.4870 4.1531 8.8187 13.6916 70.5488 17.9529 15.8271 19.2348 8.5935 20.3728 6.0638 7.0207 4.7397 4.4843 11.0009 21.8159 11.5276 0.8153 7.7041 23.9599 9.8102 30.0428 12.0929 2.1596 9.7916 0.2647 0.6743 0.9909 9.7050 2.2388 2.1403 15.1682 10.8142 14.6343 21.5689 23.0632 0.4720 2.6451 17.5952 8.6700 5.0672 8.8098 5.4780 15.0009 11.8314 2.7690 10.0099 12.6373 3.3746 8.1673 11.6618 74.2536 54.6873 243.5737 38.1477 124.0442 87.1526 43.1639 39.6170 31.3084 27.1164 28.0204 35.6272 23.7635 40.7139 23.0917 51.0517 46.7780 9.1805 68.9643 2.8588 12.5830 21.6811 44.2699 14.5980 109.0338 77.1958 52.0535 9.7535 224.4675 9.5143 7.3880 2.1004
temp: 298.150 k
press: 1.00000 atm
elementType: 8 8 8 8 7 7 6 6 6 6 6 6 6 6 6 6 6 6 6 6 6 6 1 1 1 1 1 1 1 1 1 1 1 1 1 1 1 1 1 1 1 1 1 1 1 1 1 1 1 1 1 1 1 1
symmnumber: 1
zpe: 1248856.4 jmol-1
zpe.correction: 0.475664 hartree
zpe.thermalcorrener: 0.499271 hartree
zpe.thermalcorrenthalpy: 0.500215 hartree
zpe.thermalcorrgfe: 0.421209 hartree
zpe.sumelectzpe: -1037.437370 hartree
zpe.sumelectthermal: -1037.413763 hartree
zpe.sumelectthermalent: -1037.412818 hartree
zpe.sumelectthermalfe: -1037.491825 hartree
dipole: 1.4535 0.0064 -3.5394
dipole: 3.8262
quadrupole: -110.8791 -132.3795 -141.3339
quadrupole: -4.2776 1.4269 -8.9873
quadrupole: 17.3184 -4.1820 -13.1364 -4.2776 1.4269 -8.9873
hfenergy: -1037.9130338 hartree
pointgroup: C01 [X(C16H32N2O4)]
dipole: -0.6026519 0.0849165 1.3768307 debye
polarizability: 237.9371715|-8.4657516|185.2113085|0.575059|2.5063487|171.1742029 unknown
InChI: InChI=1S/C16H32N2O4/c19-13(11-17-7-3-1-4-8-17)15(21)16(22)14(20)12-18-9-5-2-6-10-18/h13-16,19-22H,1-12H2
charge 0 multiplicity 1
54 atoms
O  -1.263601 -0.276389 -1.563093
O  0.665608 2.008472 -1.390383
O  -0.003595 -1.665899 0.901373
O  0.583343 2.366199 1.351626
N  -3.517125 -0.537563 0.139014
N  3.611056 0.353271 0.243517
C  -0.840987 0.366559 -0.309907
C  0.617936 0.8389 -0.49855
C  -1.060902 -0.631976 0.858259
C  1.325327 1.186531 0.826261
C  -2.43248 -1.361917 0.745304
C  2.811786 1.540843 0.603556
C  -4.674144 -1.381447 -0.284635
C  -3.971744 0.553019 1.051571
C  3.955277 -0.497908 1.411578
C  4.806906 0.690096 -0.572251
C  -5.732477 -0.536742 -1.022053
C  -5.003917 1.462612 0.357296
C  4.643279 -1.804548 0.967083
C  5.510365 -0.586466 -1.075272
C  -6.213467 0.638859 -0.140153
C  5.892148 -1.503064 0.108761
H  -1.461136 1.265692 -0.111944
H  1.202654 0.057857 -1.010993
H  -0.96232 -0.107547 1.823948
H  1.239434 0.342393 1.533051
H  -2.717668 -1.755803 1.748812
H  -2.280629 -2.234382 0.083581
H  3.207091 2.047871 1.527485
H  2.862027 2.269949 -0.225897
H  -4.291977 -2.18234 -0.945312
H  -5.144953 -1.876698 0.602881
H  -4.425457 0.113324 1.977075
H  -3.094957 1.145059 1.368432
H  3.029878 -0.73791 1.964986
H  4.635743 0.054285 2.115199
H  4.474847 1.305178 -1.428448
H  5.541873 1.300616 0.018354
H  -6.583117 -1.185012 -1.307055
H  -5.287996 -0.141647 -1.956331
H  -5.331377 2.249828 1.063051
H  -4.517873 1.966282 -0.50084
H  3.92199 -2.401974 0.376906
H  4.915572 -2.396384 1.86223
H  6.407856 -0.305103 -1.659259
H  4.822329 -1.126118 -1.75426
H  -6.915485 1.281861 -0.703324
H  -6.770179 0.239204 0.732922
H  6.347365 -2.44255 -0.257956
H  6.655885 -0.995855 0.734891
H  -2.264638 -0.323108 -1.463057
H  0.331343 2.771794 -0.846095
H  0.081466 -2.026459 -0.020825
H  1.12782 2.803755 2.053191
