program: Gaussian 09
title: 000040536
version: EM64L-G09RevD.01
frameworkgroup: C1[X(C17H24ClN)]
method: RPBEPBE
basis: SDD
operation: Freq
keyword: #p
keyword: freq=noraman
keyword: PBEPBE/SDD
title: #p freq=noraman PBEPBE/SDD
converged: YES YES NO NO
title: Mulliken charges:
elementType: Cl N C C C C C C C C C C C C C C C C C H H H H H H H H H H H H H H H H H H H H H H H H
charge: -0.067437 -0.080757 -0.063064 -0.116318 -0.095330 -0.263527 -0.495366 -0.503294 -0.487308 -0.471918 -0.475944 0.535759 -0.457246 -0.397288 -0.624672 -0.616472 -0.212685 -0.238190 -0.116401 0.237576 0.218150 0.219985 0.202522 0.201832 0.219573 0.212267 0.211049 0.213571 0.212495 0.204431 0.234313 0.201623 0.215321 0.237728 0.231040 0.227305 0.192095 0.219016 0.220507 0.187993 0.223980 0.251652 0.251432
chargesum: 0.00000
title: Mulliken charges with hydrogens summed into heavy atoms:
elementType: Cl N C C C C C C C C C C C C C C C C C
charge: -0.067437 -0.080757 0.174513 0.101831 0.124655 -0.061005 -0.073961 -0.079978 -0.061242 -0.033174 -0.059001 0.535759 -0.219517 -0.166248 0.013744 0.016009 0.038967 0.013242 -0.116401
polarizability: 2.46152265e+02 -1.42338273e+01 1.61604831e+02 -2.24646850e+00 5.25286063e+00 1.68456074e+02
1716.lowfreq: -13.7075 -5.6086 -0.0018 -0.0016 -0.0012 5.0101 17.2736 19.3530 35.6042
frequency: 13.6136 18.6699 35.2960 56.7932 72.1264 99.4003 145.5771 155.3465 191.0529 207.6380 216.6993 227.8197 244.7896 263.2713 297.8473 307.7238 318.0943 368.8072 382.1345 391.7639 413.7026 430.6388 454.9576 478.5059 524.7272 539.9424 578.4718 626.9748 631.1379 673.4167 719.3231 767.6794 783.5702 792.4781 807.4570 815.8428 828.2408 829.3214 852.4512 872.7070 886.1807 930.6294 938.0079 948.1663 963.1432 964.4244 997.7863 1000.9997 1026.1142 1032.4040 1047.4946 1055.8250 1063.9213 1074.1942 1076.5712 1086.8758 1098.7598 1107.8123 1109.2640 1133.4647 1149.3706 1164.4412 1178.0118 1185.2901 1195.9429 1206.4588 1227.0067 1231.5763 1238.1333 1259.5797 1269.3133 1277.2582 1281.5577 1294.5249 1306.9138 1313.1089 1319.2592 1323.7468 1329.2879 1338.5948 1355.1854 1360.6093 1367.1443 1381.4508 1401.3506 1417.7388 1441.5382 1459.9147 1462.1040 1467.2126 1471.1334 1473.5343 1475.7699 1477.3020 1484.4505 1486.6640 1496.7370 1583.3796 1596.6215 2824.6489 2846.6917 2861.4573 2943.5652 2971.7217 2973.9421 2977.3534 2988.9130 2992.9600 3009.3276 3011.0610 3015.9687 3019.3601 3022.9317 3026.6798 3031.0706 3046.2343 3053.4946 3074.7036 3082.2997 3123.1776 3134.6268 3164.1552 3167.5481
redmass: 3.2460 2.9769 3.8225 3.6132 4.1478 3.4955 3.6703 4.1223 1.5283 3.1347 2.1246 1.2252 2.3186 2.5624 2.7437 2.9216 3.8293 2.1347 2.5139 2.8683 2.9111 4.8042 2.4314 3.7999 3.3421 3.0644 3.8429 6.7146 6.3267 4.8704 3.7623 2.4836 2.7188 1.6782 1.6570 1.8724 1.9998 1.6465 2.2740 2.4151 2.2354 3.0773 1.6036 1.4495 2.5312 1.4711 3.8111 2.1664 2.3113 1.5604 2.1382 2.1160 1.9558 2.6190 1.8544 1.3550 1.5788 1.8950 1.4281 1.3915 1.1103 1.6620 1.5541 1.1622 1.3977 2.1592 1.1414 1.2410 1.4117 2.3049 1.5431 1.5476 1.6153 1.4261 1.5311 1.2963 1.4801 1.4708 1.6594 1.4725 1.4981 1.4582 1.4260 4.5760 2.0519 1.1443 1.1548 1.0488 1.0798 1.0708 1.0838 1.0972 2.2558 1.0542 1.0674 1.0777 1.0906 7.1432 6.3310 1.0702 1.0571 1.0574 1.0829 1.0601 1.0591 1.0815 1.0653 1.0640 1.0870 1.0808 1.0719 1.1023 1.1021 1.0722 1.0861 1.1032 1.1026 1.1010 1.1003 1.0895 1.0883 1.0951 1.0960
irintensity: 0.3071 0.2939 0.1014 0.2021 0.2930 0.2842 0.0588 0.2334 0.2877 0.4289 0.0769 0.2344 0.3186 0.4908 4.3346 0.5885 1.4457 7.2671 1.5362 2.1250 0.0014 8.9592 2.3198 1.8383 14.3890 12.2891 5.8236 1.2274 1.4045 9.3352 2.6725 11.1522 3.6552 10.0217 0.9753 62.5361 5.3433 5.4548 1.8537 4.6067 8.4672 3.0476 0.1623 0.7370 4.7181 1.4848 30.7894 12.3195 33.4749 13.7987 10.9759 1.7839 1.5112 33.1185 6.3686 4.3404 3.1284 10.8909 6.3830 7.1716 1.1461 7.2644 1.0443 1.7016 6.4359 3.3789 0.0814 1.4409 18.8077 5.8854 10.6676 3.2946 4.4917 0.5784 0.6358 1.2836 2.4120 0.4524 1.1976 2.3434 2.6265 4.0645 5.4122 0.5499 5.8284 2.5038 1.1372 14.8047 8.2324 3.1868 13.1444 10.3234 84.5189 21.7232 17.6028 22.8607 7.8001 1.3923 2.9434 67.5368 69.3672 215.8743 23.4384 39.7142 16.5830 18.3911 44.1293 71.5369 48.3909 85.8889 45.3563 1.4874 5.9120 33.3192 32.7320 39.7998 124.0887 29.8391 53.5696 11.0163 14.4229 8.9418 0.4810
temp: 298.150 k
press: 1.00000 atm
elementType: 17 7 6 6 6 6 6 6 6 6 6 6 6 6 6 6 6 6 6 1 1 1 1 1 1 1 1 1 1 1 1 1 1 1 1 1 1 1 1 1 1 1 1
symmnumber: 1
zpe: 975501.8 jmol-1
zpe.correction: 0.371549 hartree
zpe.thermalcorrener: 0.389968 hartree
zpe.thermalcorrenthalpy: 0.390912 hartree
zpe.thermalcorrgfe: 0.322557 hartree
zpe.sumelectzpe: -1175.549618 hartree
zpe.sumelectthermal: -1175.531199 hartree
zpe.sumelectthermalent: -1175.530255 hartree
zpe.sumelectthermalfe: -1175.598611 hartree
dipole: 2.4913 -0.0662 -0.5916
dipole: 2.5614
quadrupole: -138.2173 -121.2225 -115.5535
quadrupole: 3.0415 0.0028 1.3337
quadrupole: -13.2195 3.7753 9.4443 3.0415 0.0028 1.3337
hfenergy: -1175.9211671 hartree
pointgroup: C01 [X(C17H24Cl1N1)]
dipole: 0.9748073 0.0403365 0.2522929 debye
polarizability: 245.4889529|15.6158021|161.9924959|3.8715847|5.500747|168.7317202 unknown
InChI: InChI=1S/C17H24ClN/c1-19(2)11-16-12-3-5-13(6-4-12)17(16)14-7-9-15(18)10-8-14/h7-10,12-13,16-17H,3-6,11H2,1-2H3
charge 0 multiplicity 1
43 atoms
Cl -5.755437 -0.915877 -0.372984
N  2.784693 -2.217615 -0.071072
C  2.376684 0.80245 -0.624198
C  0.394881 2.13503 0.423841
C  1.263156 -0.18761 -0.177427
C  0.164686 0.592199 0.629659
C  2.887922 1.642312 0.576773
C  1.774008 1.763372 -1.682476
C  1.717945 2.519004 1.139475
C  0.518737 2.485693 -1.081124
C  1.788974 -1.386143 0.646962
C  -1.277545 0.174136 0.346742
C  -2.20614 0.121137 1.42036
C  -1.763381 -0.116237 -0.956278
C  2.205415 -2.991135 -1.187826
C  3.549641 -3.085253 0.847859
C  -3.565138 -0.20575 1.218266
C  -3.118622 -0.445785 -1.184452
C  -4.00161 -0.48473 -0.090195
H  3.210631 0.218785 -1.056365
H  -0.452847 2.688769 0.872711
H  0.804506 -0.589707 -1.102616
H  0.340918 0.407624 1.71147
H  3.727249 2.280925 0.242059
H  3.299251 0.978251 1.360374
H  1.500819 1.194607 -2.592853
H  2.539603 2.50204 -1.988236
H  1.608565 2.377904 2.232416
H  1.918839 3.595144 0.975221
H  0.609553 3.583281 -1.188276
H  -0.405988 2.196377 -1.613501
H  0.911349 -1.998305 0.987916
H  2.279455 -1.000892 1.562515
H  -1.860323 0.335669 2.439064
H  -1.084606 -0.095166 -1.815869
H  1.748872 -2.315577 -1.930955
H  1.421238 -3.719495 -0.856134
H  3.005765 -3.557261 -1.697236
H  4.335964 -3.62119 0.285822
H  2.917998 -3.85115 1.367063
H  4.042377 -2.468639 1.620792
H  -4.264847 -0.247353 2.058154
H  -3.478011 -0.667741 -2.193638
