program: Gaussian 09
title: 000040538
version: EM64L-G09RevD.01
frameworkgroup: C1[X(C17H25N)]
method: RPBEPBE
basis: SDD
operation: Freq
keyword: #pfreq=noraman
keyword: PBEPBE/SDD
title: #p freq=noraman PBEPBE/SDD
converged: YES YES NO NO
title: Mulliken charges:
elementType: N C C C C C C C C C C C C C C C C C H H H H H H H H H H H H H H H H H H H H H H H H H
charge: -0.081126 -0.063239 -0.115581 -0.091872 -0.255470 -0.493473 -0.502459 -0.486020 -0.473148 -0.477629 0.506854 -0.463025 -0.402127 -0.622106 -0.618460 -0.227094 -0.256011 -0.251147 0.234502 0.217268 0.219455 0.197784 0.200591 0.215920 0.211732 0.209156 0.212415 0.210736 0.201009 0.235901 0.203501 0.213707 0.230536 0.222435 0.227024 0.190862 0.217667 0.219158 0.187044 0.224554 0.221745 0.221952 0.226476
chargesum: 0.00000
title: Mulliken charges with hydrogens summed into heavy atoms:
elementType: N C C C C C C C C C C C C C C C C C
charge: -0.081126 0.171263 0.101687 0.127583 -0.057686 -0.076962 -0.081571 -0.062869 -0.036237 -0.060420 0.506854 -0.232488 -0.179691 0.013447 0.012296 -0.005349 -0.034058 -0.024672
polarizability: 2.07473576e+02 -1.87488915e+01 1.64380387e+02 -2.94374859e-01 -4.88177939e+00 1.66258802e+02
1716.lowfreq: -8.9127 -0.0005 0.0006 0.0007 5.6624 12.6716 25.1867 32.7350 41.7167
frequency: 24.2990 32.5350 41.3957 61.8439 93.3252 114.0371 164.7647 196.0477 218.9179 226.6845 239.2455 254.7912 267.9086 281.1418 303.2126 366.6298 375.1870 391.8145 408.1161 449.2122 474.0392 521.4509 541.6774 562.8872 609.3699 618.1700 647.3112 707.4244 749.2526 771.5000 783.4784 798.9384 806.8751 827.2541 842.4135 851.2057 870.8538 887.6159 915.7852 929.8490 938.8646 961.8896 973.1790 989.7950 990.3221 1001.2613 1025.7104 1028.3317 1034.0419 1047.7917 1054.0860 1064.1182 1074.3295 1083.5328 1088.7602 1102.7632 1108.2821 1133.2634 1149.3272 1163.8745 1170.4413 1180.2737 1190.1977 1194.7562 1207.5914 1227.5071 1231.7753 1239.4396 1259.2607 1268.3718 1279.6289 1281.4092 1303.7778 1311.7569 1313.8261 1320.7634 1323.8026 1335.5817 1343.1349 1357.0122 1361.9904 1368.6616 1384.7585 1419.4057 1438.9598 1440.0354 1459.6919 1462.2847 1466.6737 1471.5809 1472.7569 1476.7043 1481.2379 1484.1962 1486.2774 1495.9602 1588.4389 1611.3579 2828.7684 2844.5482 2860.4835 2940.2566 2971.2016 2973.0744 2982.4751 2988.9380 2992.4745 3007.9660 3011.9692 3014.6966 3018.7121 3022.0187 3026.6823 3029.6118 3045.6770 3052.7024 3073.7653 3083.4475 3109.6296 3116.2318 3130.5845 3140.0529 3159.8607
redmass: 3.4713 2.7384 3.3381 2.9480 3.4932 3.2639 2.6270 1.5963 3.1206 1.5343 1.4411 2.7046 2.3790 2.4749 2.3152 2.0271 2.4155 2.2822 2.8303 2.3205 3.7848 3.5543 3.1181 4.0193 5.6426 6.3248 4.5490 1.6681 2.2927 1.9017 2.6600 2.1659 1.6194 3.0719 2.4739 1.2461 2.5236 2.2220 1.4797 2.9074 1.7516 2.9909 1.3879 5.7942 1.3668 2.0729 2.3047 2.1793 1.5554 2.1257 2.1117 1.8757 1.8603 1.6376 1.3186 1.6907 1.8407 1.3825 1.0985 1.6418 1.0589 1.6274 1.1422 1.3084 2.2531 1.1435 1.2671 1.4089 2.2801 1.5823 1.6248 1.6028 1.6251 1.3650 1.3796 1.4207 1.4938 1.4757 1.3977 1.4115 1.4710 1.4772 4.1017 1.1408 1.3455 1.6807 1.0848 1.0521 1.0736 1.0818 1.0744 1.0544 2.0386 1.1322 1.0587 1.0924 5.8544 6.1266 1.0695 1.0576 1.0578 1.0833 1.0598 1.0592 1.0811 1.0648 1.0637 1.0877 1.0822 1.0721 1.1020 1.1018 1.0725 1.0860 1.1031 1.1025 1.1009 1.1000 1.0869 1.0856 1.0907 1.0957 1.1013
irintensity: 0.0247 0.2910 0.1314 0.3288 0.3462 0.8603 0.0602 0.1316 0.5908 0.8292 0.3366 0.0458 0.4358 0.4429 5.3104 5.4556 0.2484 0.0077 0.0050 0.6754 0.2875 4.0298 8.9849 7.1183 2.0966 0.2908 1.0755 53.0504 25.1450 15.8794 2.1376 17.7892 2.2680 6.3651 6.7376 0.1437 3.7216 6.3352 0.6054 1.3011 0.2585 3.4578 0.2710 0.0797 0.5593 5.2313 34.2994 7.1288 13.6110 11.9044 1.8720 1.4110 2.6003 8.4057 4.7373 5.8723 3.9978 7.0635 1.0055 6.3431 0.0124 1.4971 1.2358 5.9964 0.8762 0.1112 1.1235 17.8875 5.6014 12.2992 2.3676 4.5539 0.4245 0.3455 1.6404 2.2481 0.6683 2.8935 0.5089 3.9607 1.0192 5.7104 0.8183 3.4921 5.1840 3.7153 6.8033 17.3010 1.0093 12.2295 8.1631 18.0531 19.1458 21.9205 16.5075 9.6107 1.8179 13.2459 60.2208 67.0004 225.5122 25.2345 46.2740 13.8625 12.9252 42.4321 73.2393 49.0431 87.4806 46.0251 2.3770 8.4563 31.4245 35.6122 42.3910 120.8175 32.8475 50.9161 9.9148 6.2486 13.3535 48.1199 26.9664
temp: 298.150 k
press: 1.00000 atm
elementType: 7 6 6 6 6 6 6 6 6 6 6 6 6 6 6 6 6 6 1 1 1 1 1 1 1 1 1 1 1 1 1 1 1 1 1 1 1 1 1 1 1 1 1
symmnumber: 1
zpe: 1001149.3 jmol-1
zpe.correction: 0.381318 hartree
zpe.thermalcorrener: 0.398341 hartree
zpe.thermalcorrenthalpy: 0.399285 hartree
zpe.thermalcorrgfe: 0.335582 hartree
zpe.sumelectzpe: -716.158705 hartree
zpe.sumelectthermal: -716.141681 hartree
zpe.sumelectthermalent: -716.140737 hartree
zpe.sumelectthermalfe: -716.204440 hartree
dipole: -0.1699 -0.4067 -0.3486
dipole: 0.5620
quadrupole: -109.7831 -109.7340 -105.3689
quadrupole: -0.2722 0.9685 -1.4561
quadrupole: -1.4878 -1.4387 2.9264 -0.2722 0.9685 -1.4561
hfenergy: -716.5400226 hartree
pointgroup: C01 [X(C17H25N1)]
dipole: 0.0544705 -0.1671286 0.1341434 debye
polarizability: 209.785714|15.6236498|161.8429611|0.8492608|4.964016|166.4840899 unknown
InChI: InChI=1S/C17H25N/c1-18(2)12-16-13-8-10-15(11-9-13)17(16)14-6-4-3-5-7-14/h3-7,13,15-17H,8-12H2,1-2H3
charge 0 multiplicity 1
43 atoms
N  2.701128 -1.976811 -0.092787
C  1.997975 1.03476 -0.538142
C  -0.189066 2.077178 0.429689
C  0.995883 -0.098221 -0.171504
C  -0.220007 0.515176 0.609412
C  2.334066 1.900813 0.705709
C  1.331868 1.942936 -1.606676
C  1.037823 2.62276 1.208621
C  -0.043459 2.464282 -1.064344
C  1.631362 -1.252913 0.637244
C  -1.584617 -0.087639 0.273838
C  -2.527666 -0.2919 1.316821
C  -1.987859 -0.407135 -1.050767
C  2.185388 -2.823356 -1.187708
C  3.577234 -2.743152 0.816502
C  -3.822195 -0.791882 1.054598
C  -3.281605 -0.907456 -1.320648
C  -4.207094 -1.102095 -0.270258
H  2.918945 0.570995 -0.938331
H  -1.122926 2.50595 0.842615
H  0.62598 -0.519552 -1.127172
H  -0.052711 0.336716 1.694058
H  3.11234 2.639593 0.435586
H  2.770364 1.270768 1.504203
H  1.192076 1.375194 -2.547341
H  2.005153 2.789384 -1.84335
H  0.89472 2.465465 2.295361
H  1.110593 3.716207 1.050421
H  -0.109149 3.564928 -1.159715
H  -0.887927 2.050301 -1.645243
H  0.816182 -1.950338 0.967188
H  2.082123 -0.8361 1.559513
H  -2.237655 -0.057881 2.349442
H  -1.288296 -0.272798 -1.884029
H  1.633021 -2.21183 -1.921058
H  1.498903 -3.632459 -0.827824
H  3.031153 -3.298947 -1.716028
H  4.402069 -3.201017 0.24058
H  3.045561 -3.563706 1.364013
H  4.02082 -2.064559 1.56695
H  -4.526681 -0.943723 1.880652
H  -3.567016 -1.145935 -2.351964
H  -5.209505 -1.4922 -0.479627
