program: Gaussian 09
title: 000040484
version: EM64L-G09RevD.01
frameworkgroup: C1[X(C12HCl9)]
method: RPBEPBE
basis: SDD
operation: Freq
keyword: #pfreq=noraman
keyword: PBEPBE/SDD
title: #p freq=noraman PBEPBE/SDD
converged: NO NO NO NO
title: Mulliken charges:
elementType: Cl Cl Cl Cl Cl Cl Cl Cl Cl C C C C C C C C C C C C H
charge: 0.052509 0.052488 0.043293 0.043302 0.064225 0.064207 0.073314 0.021836 0.021833 0.582155 0.555341 -0.305070 -0.305057 -0.281737 -0.281771 -0.084775 -0.084745 -0.112619 -0.091232 -0.091200 -0.225554 0.289259
chargesum: 0.00000
title: Mulliken charges with hydrogens summed into heavy atoms:
elementType: Cl Cl Cl Cl Cl Cl Cl Cl Cl C C C C C C C C C C C C
charge: 0.052509 0.052488 0.043293 0.043302 0.064225 0.064207 0.073314 0.021836 0.021833 0.582155 0.555341 -0.305070 -0.305057 -0.281737 -0.281771 -0.084775 -0.084745 -0.112619 -0.091232 -0.091200 0.063705
polarizability: 2.86655169e+02 -3.18299915e-04 1.88708942e+02 7.39128438e-03 3.56584498e-02 1.88179753e+02
1716.lowfreq: -2.5243 0.0010 0.0015 0.0028 4.0230 5.9055 18.9432 30.7285 36.4598
frequency: 18.9201 30.7282 36.4505 64.0237 67.0822 72.2267 84.9153 91.8267 125.5407 154.7496 183.2992 189.1602 198.8161 203.5959 204.3847 208.0311 216.3812 249.8721 302.2933 304.2554 312.6806 326.5523 327.9613 332.3910 335.8691 358.4130 364.2494 485.9082 510.8152 518.7584 588.8373 591.7840 598.5091 603.8275 616.0701 651.1131 677.4872 739.2014 764.7267 789.9040 818.2973 823.4488 871.8267 879.7612 1016.9482 1078.0451 1159.9548 1161.2611 1229.0901 1314.2222 1314.5643 1326.0069 1337.4896 1379.8008 1409.9489 1516.5689 1545.0684 1547.5867 1563.5229 3176.1667
redmass: 31.3237 29.1251 22.6631 34.2464 34.2577 31.9516 27.6456 31.9762 29.9467 10.2932 32.4236 13.9521 31.1561 34.3517 31.0271 26.4477 34.4605 21.7395 9.7730 26.4603 12.1583 12.5166 29.9943 31.3627 12.5123 32.6992 12.6523 15.1539 6.1203 7.9403 12.0275 11.3311 12.0832 12.0876 10.0110 9.1058 12.7814 11.7680 9.1104 11.9494 12.2600 12.8711 1.4270 11.5843 11.3877 11.6749 11.6491 1.5435 11.3636 12.0525 11.2607 12.0032 11.5155 3.3277 11.5202 12.0009 11.7938 8.0743 11.6300 1.0932
irintensity: 0.0000 0.0143 0.0670 0.0000 0.0000 0.0095 0.0098 0.0171 0.0380 0.1974 0.0352 0.0709 0.0592 0.1977 0.0411 0.3800 0.0001 0.2314 0.4194 0.0002 0.7148 0.0000 0.0032 0.0023 0.0000 0.0542 0.5187 32.1689 10.1715 1.7191 25.0630 37.8104 0.0022 0.0015 22.1892 32.1084 27.8685 6.4699 10.5978 3.3481 1.4273 0.6689 18.4377 32.6735 81.0117 2.8045 9.6433 43.0052 1.6508 173.6923 159.9205 10.8628 0.3982 152.1366 14.0223 0.1090 2.0118 11.1476 12.6799 2.4431
temp: 298.150 k
press: 1.00000 atm
elementType: 17 17 17 17 17 17 17 17 17 6 6 6 6 6 6 6 6 6 6 6 6 1
symmnumber: 1
zpe: 239080.8 jmol-1
zpe.correction: 0.091061 hartree
zpe.thermalcorrener: 0.112079 hartree
zpe.thermalcorrenthalpy: 0.113023 hartree
zpe.thermalcorrgfe: 0.037502 hartree
zpe.sumelectzpe: -4596.915997 hartree
zpe.sumelectthermal: -4596.894979 hartree
zpe.sumelectthermalent: -4596.894035 hartree
zpe.sumelectthermalfe: -4596.969556 hartree
dipole: -1.1446 0.0001 0.0001
dipole: 1.1446
quadrupole: -174.0232 -182.2933 -184.5115
quadrupole: -0.0010 -0.0015 -0.2097
quadrupole: 6.2528 -2.0173 -4.2355 -0.0010 -0.0015 -0.2097
hfenergy: -4597.007058 hartree
pointgroup: C01 [X(C12H1Cl9)]
dipole: -0.450308 0.0000548 0.000005 debye
dipolederiv: -0.2452838 0.2693394 -0.0050608 0.267152 -0.4917971 0.0092215 -0.0049249 0.0090513 0.0091457 -0.245349 -0.2693609 0.0050391 -0.2671548 -0.4917509 0.0091864 0.0049752 0.0092011 0.0091304 -0.2292016 -0.0052666 -0.275662 -0.0046148 0.0045392 -0.0096561 -0.2410434 -0.0096563 -0.508718 -0.2291482 0.0052738 0.2756346 0.0046034 0.0045435 -0.0096374 0.2410038 -0.0096609 -0.5087846 -0.2087501 0.2857106 -0.0052455 0.3293052 -0.4939927 0.0093552 -0.0060565 0.0093952 0.0184498 -0.2087912 -0.2857098 0.005208 -0.3293281 -0.4939592 0.0093093 0.0059914 0.009388 0.0184389 -0.7295242 0.000038 -0.0000931 0.0000503 0.0003896 0.0004675 -0.0000797 0.0003833 0.0206808 -0.3219483 -0.0061627 -0.3227735 -0.006965 -0.010037 -0.0098092 -0.362234 -0.0097781 -0.5225797 -0.3218854 0.0062215 0.3227276 0.0070863 -0.0100444 -0.0099636 0.3622124 -0.0098474 -0.522613 0.1749882 -0.0000358 -0.0000289 -0.0000057 -0.2866883 0.0059338 -0.0000364 0.0061185 0.0461287 0.2317166 -0.0000123 -0.0000089 -0.0000508 0.0471507 -0.005107 0.0000128 -0.004963 -0.2254705 0.2370508 -0.4707814 0.0087579 -0.4477173 0.6159605 -0.0118853 0.0081082 -0.0117341 -0.0264191 0.2371571 0.4708176 -0.0087169 0.4477404 0.6158953 -0.0119057 -0.0081071 -0.0119837 -0.0264054 0.106053 0.0094841 0.4987827 0.0088105 -0.0312814 0.011816 0.4683789 0.011695 0.5953666 0.1059696 -0.0094556 -0.4987605 -0.0087182 -0.0312803 0.0118377 -0.4683492 0.0117292 0.5955143 -0.0205089 -0.557938 0.0101844 -0.6024502 0.6070844 -0.0114455 0.0110283 -0.0115138 -0.0227638 -0.0204129 0.558012 -0.010209 0.602454 0.6070161 -0.0114204 -0.0110452 -0.0115591 -0.0227527 1.0220576 -0.0000887 0.0001746 -0.000036 -0.1949273 0.0029678 0.0001259 0.0030708 -0.0260156 0.4066265 0.0103193 0.5471063 0.0127731 -0.0435891 0.013829 0.6670748 0.0138207 0.6719432 0.4064818 -0.0104286 -0.5470496 -0.0129999 -0.0435842 0.0140486 -0.6670349 0.0139754 0.6720244 -0.1877012 0.0000124 -0.0000075 0.0000461 -0.0428688 -0.0055091 -0.0000068 -0.0055913 -0.3259143 0.0404038 0.0000118 0.000001 0.0000197 0.1632214 -0.0016335 0.0000066 -0.0015408 0.0816139 unknown
polarizability: 286.6551665|-0.0065402|188.700783|0.0152672|0.0743129|188.1879137 unknown
InChI: InChI=1S/C12HCl9/c13-2-1-3(14)7(16)4(6(2)15)5-8(17)10(19)12(21)11(20)9(5)18/h1H
charge 0 multiplicity 1
22 atoms
Cl 0.316775 2.767042 -0.050937
Cl 0.316496 -2.767133 0.050736
Cl -0.814946 0.05264 2.77525
Cl -0.815257 -0.052501 -2.775507
Cl 3.534124 -2.783155 0.051129
Cl 3.534287 2.782856 -0.050703
Cl 5.141935 -0.000292 0.000564
Cl -4.076552 -0.052722 -2.751011
Cl -4.076232 0.05325 2.751114
C  0.500065 -0.000059 -0.000191
C  -1.000167 -0.000001 -0.000151
C  1.225758 1.215729 -0.022538
C  1.225656 -1.215889 0.022194
C  -1.721975 0.023262 1.220665
C  -1.722131 -0.023192 -1.220847
C  2.639855 -1.226822 0.022584
C  2.639945 1.226535 -0.022339
C  3.347944 -0.000171 0.000301
C  -3.135673 -0.023274 -1.218006
C  -3.135496 0.023454 1.218014
C  -3.840453 0.000155 0.000045
H  -4.933859 0.000286 0.000133
