program: Gaussian 09
title: 000005819
version: EM64L-G09RevD.01
frameworkgroup: C1[X(C15H11I4NO4)]
method: RPBEPBE
basis: SDD
operation: Freq
keyword: #p
keyword: freq=noraman
keyword: PBEPBE/SDD
title: #p freq=noraman PBEPBE/SDD
converged: YES YES NO NO
title: Mulliken charges:
elementType: I I I I O O O O N C C C C C C C C C C C C C C C H H H H H H H H H H H
charge: 0.154775 0.151662 0.131930 0.139815 -0.275562 -0.403622 -0.236720 -0.391355 -0.579985 -0.607698 -0.173752 0.539162 -0.351127 -0.362002 0.505803 -0.479892 -0.472027 0.194381 0.345063 -0.216182 -0.334891 -0.477438 -0.491551 0.555282 0.236186 0.225495 0.265880 0.255088 0.274138 0.282055 0.298560 0.283924 0.279881 0.386860 0.347865
chargesum: 0.00000
title: Mulliken charges with hydrogens summed into heavy atoms:
elementType: I I I I O O O O N C C C C C C C C C C C C C C C
charge: 0.154775 0.151662 0.131930 0.139815 -0.275562 -0.016763 -0.236720 -0.043490 0.000630 -0.146017 0.092128 0.539162 -0.096039 -0.087863 0.505803 -0.479892 -0.472027 0.194381 0.345063 0.067742 -0.055009 -0.477438 -0.491551 0.555282
polarizability: 3.80956550e+02 3.75005767e+01 2.42501844e+02 -1.55401809e+01 5.01889515e+00 2.39958709e+02
1716.lowfreq: -3.8863 -2.7268 -0.5031 0.0003 0.0004 0.0004 7.8825 8.8395 12.2413
frequency: 7.7434 8.8032 12.1906 14.7961 28.9958 37.0860 41.8307 57.5714 69.7446 72.3577 99.0258 114.9173 119.5853 136.3904 170.6236 178.8894 184.0764 200.8274 209.6939 222.5666 235.1470 242.3438 254.2787 274.0725 293.2630 343.7386 345.3850 364.9604 382.5801 402.7088 444.5566 480.3302 482.6406 492.4928 493.6263 515.5129 534.0181 548.9964 566.6605 598.9481 618.5705 647.4352 680.5086 690.1566 703.6909 710.8268 728.0567 757.0670 763.7765 798.6643 863.1945 863.6860 875.2814 878.9877 895.8859 898.6268 949.1479 967.8328 1021.0620 1030.2301 1059.0638 1100.5236 1129.9084 1130.6965 1161.7187 1184.7311 1196.8964 1202.4183 1219.8825 1233.7760 1260.1870 1283.4009 1284.4368 1323.0050 1347.0990 1366.1464 1378.5366 1393.5874 1403.3883 1420.8597 1448.8019 1464.3644 1536.5681 1557.7232 1575.8010 1596.5515 1611.2045 1668.2290 2999.0321 3049.0574 3070.3904 3149.6620 3154.7561 3174.0166 3184.9230 3460.5786 3490.5400 3494.0884 3630.7324
redmass: 18.4659 16.4520 28.0305 9.5285 9.0850 10.6268 15.7817 5.9130 63.6159 11.1187 27.9990 10.6403 10.4603 9.5119 4.6117 4.5302 6.1286 5.7484 9.0315 1.9343 6.4236 6.8600 5.6308 3.3260 2.4011 5.9417 6.6711 3.7284 6.5066 1.0896 4.3589 2.9151 5.2734 3.2323 2.8999 5.5519 5.7399 4.7155 3.5195 3.4384 1.8491 2.0027 7.8676 8.9799 7.1414 6.2187 4.4897 7.5979 2.8936 6.0957 1.9654 2.0316 1.3842 2.5621 5.8678 1.4074 1.7918 4.5007 3.6267 3.7621 2.6521 1.4689 1.5485 1.6222 2.2585 1.6427 1.6032 1.6846 2.4314 3.2944 1.6576 1.5538 1.9966 1.2212 6.5251 3.9101 2.5598 4.9910 1.8768 3.7197 3.8533 1.1061 7.9283 7.7641 6.9084 8.0027 1.2916 3.9238 1.0596 1.0898 1.1010 1.0922 1.0929 1.0921 1.0935 1.0650 1.0448 1.0635 1.1001
irintensity: 0.2338 0.1356 0.0172 1.6555 1.7740 0.5235 0.5064 1.3979 0.0185 0.1747 0.2112 0.4711 0.0837 0.4048 0.0058 1.2361 0.7823 9.7748 0.5733 43.9144 6.4628 5.9947 2.5715 17.8988 15.2790 2.9227 1.3138 4.8939 1.1285 124.4825 28.8292 85.2124 0.4629 72.9289 87.5439 5.8884 43.8205 36.4670 1.1867 8.0640 82.0392 124.3413 29.8679 59.7886 16.5934 11.6308 59.9683 47.2571 1.9781 29.7021 15.6774 11.4580 6.7606 57.6222 34.8221 0.2298 13.5246 57.1728 1.5926 13.7757 230.1651 15.9238 165.1574 16.8966 71.0091 3.6875 40.1822 67.6605 81.7967 82.3368 5.7342 6.8924 48.0576 7.0097 2.7300 141.1118 38.9255 6.8651 11.1473 292.3314 145.9142 10.6306 70.8855 47.8742 31.4572 89.9959 156.3595 125.7102 33.4121 5.9131 16.0426 1.9514 3.9064 0.4753 1.9589 83.7139 18.8081 20.6880 11.6014
temp: 298.150 k
press: 1.00000 atm
elementType: 53 53 53 53 8 8 8 8 7 6 6 6 6 6 6 6 6 6 6 6 6 6 6 6 1 1 1 1 1 1 1 1 1 1 1
symmnumber: 1
zpe: 598276.1 jmol-1
zpe.correction: 0.227871 hartree
zpe.thermalcorrener: 0.253769 hartree
zpe.thermalcorrenthalpy: 0.254714 hartree
zpe.thermalcorrgfe: 0.161409 hartree
zpe.sumelectzpe: -978.116576 hartree
zpe.sumelectthermal: -978.090678 hartree
zpe.sumelectthermalent: -978.089733 hartree
zpe.sumelectthermalfe: -978.183038 hartree
dipole: 2.0888 -1.6708 -0.7321
dipole: 2.7733
quadrupole: -162.0873 -205.8018 -198.1460
quadrupole: -6.5005 -10.6401 3.0685
quadrupole: 26.5911 -17.1235 -9.4676 -6.5005 -10.6401 3.0685
hfenergy: -978.3444471 hartree
pointgroup: C01 [X(C15H11I4N1O4)]
dipole: -0.7416196 -0.7284756 0.3313489 debye
polarizability: 386.4827939|-23.042683|235.7809219|-17.4988788|-5.9278001|241.1533872 unknown
InChI: InChI=1S/C15H11I4NO4/c16-8-4-7(5-9(17)13(8)21)24-14-10(18)1-6(2-11(14)19)3-12(20)15(22)23/h1-2,4-5,12,21-22H,3,20H2
charge 0 multiplicity 1
35 atoms
I  0.141968 -0.896551 -3.25765
I  0.617677 -2.445253 2.685832
I  6.696194 -0.229325 -0.530829
I  2.101893 3.633391 0.844061
O  1.442041 -1.761748 -0.390947
O  -2.85159 2.060645 0.366535
O  -4.542611 1.778591 -1.202072
O  5.040196 2.53616 0.295112
N  -5.995033 0.682236 1.030055
C  -4.249431 -1.018798 0.254652
C  -4.569168 0.415016 0.851665
C  -2.766358 -1.276629 0.067525
C  -1.96278 -1.677117 1.164944
C  -2.150307 -1.055827 -1.190287
C  0.055679 -1.566662 -0.232393
C  -0.75617 -1.202749 -1.33655
C  -0.569091 -1.820167 1.015289
C  -4.023835 1.476217 -0.104046
C  2.307471 -0.646971 -0.206792
C  1.849509 0.639252 0.150259
C  3.678693 -0.907788 -0.400266
C  4.592012 0.147512 -0.234186
C  2.786618 1.677879 0.309291
C  4.17668 1.461766 0.121884
H  -4.790906 -1.103037 -0.705522
H  -4.689373 -1.751898 0.956596
H  -4.047351 0.51814 1.818214
H  -2.426633 -1.875221 2.136358
H  -2.761824 -0.766789 -2.050938
H  -6.473922 0.119552 1.734246
H  -6.518595 0.828243 0.163393
H  0.784399 0.831634 0.300323
H  3.998785 -1.91538 -0.67325
H  -2.513284 2.724836 -0.295972
H  5.983449 2.259239 0.137067
