program: Gaussian 09
title: 000040483
version: EM64L-G09RevD.01
frameworkgroup: C1[X(C12H2Cl8)]
method: RPBEPBE
basis: SDD
operation: Freq
keyword: #pfreq=noraman
keyword: PBEPBE/SDD
title: #p freq=noraman PBEPBE/SDD
converged: NO NO NO YES
title: Mulliken charges:
elementType: Cl Cl Cl Cl Cl Cl Cl Cl C C C C C C C C C C C C H H
charge: 0.048997 0.048997 -0.007636 0.063712 0.063712 0.072079 0.009259 0.018013 0.587017 0.415586 -0.325050 -0.325035 -0.300720 -0.302396 -0.083589 -0.083582 -0.108299 -0.084624 -0.178986 -0.093997 0.279308 0.287236
chargesum: 0.00000
title: Mulliken charges with hydrogens summed into heavy atoms:
elementType: Cl Cl Cl Cl Cl Cl Cl Cl C C C C C C C C C C C C
charge: 0.048997 0.048997 -0.007636 0.063712 0.063712 0.072079 0.009259 0.018013 0.587017 0.415586 -0.325050 -0.325035 -0.300720 -0.023088 -0.083589 -0.083582 -0.108299 -0.084624 0.108250 -0.093997
polarizability: 3.01383075e+02 -6.93685230e-04 1.86640796e+02 -8.30136443e+00 -8.62321865e-04 1.48595918e+02
1716.lowfreq: -0.0013 0.0001 0.0014 5.1570 5.2705 6.3697 14.3190 31.3672 34.5081
frequency: 14.2621 31.3658 34.4989 65.2217 71.8450 74.3511 95.1780 132.2111 157.3205 177.9506 190.1179 203.0293 204.1048 205.1495 216.6295 224.6476 236.1301 307.4120 313.3075 326.1412 328.1956 343.4129 356.3103 365.1366 430.1967 444.5305 479.5615 534.6379 562.5062 599.9643 620.9781 626.2956 648.4707 652.9547 673.2585 727.4335 772.7607 784.7964 818.8427 864.5290 872.2335 889.0130 1008.6644 1054.0854 1116.5118 1143.6688 1237.8045 1243.3578 1309.4614 1311.4326 1328.8199 1350.8447 1377.6544 1452.1812 1515.9327 1547.2965 1551.2225 1590.5137 3167.1705 3179.9023
redmass: 22.8087 26.3788 22.6824 34.1774 30.8105 29.2184 27.0044 27.3023 9.8134 24.3119 16.3912 26.2835 28.1217 27.6742 30.8749 6.1955 22.1920 28.6637 26.2560 12.4773 30.1061 12.1344 31.3813 10.9236 14.5238 3.2781 7.0791 12.2639 11.6804 12.0782 12.9426 10.5447 10.2146 7.2120 8.0487 4.4809 11.9652 11.6912 12.5113 1.4637 10.7546 1.4431 10.5494 5.4796 1.9104 10.9462 1.4536 3.6402 9.6775 11.9860 11.9994 8.4061 6.2053 3.8879 11.9851 10.0041 11.1822 8.5071 1.0928 1.0932
irintensity: 0.0036 0.0025 0.0007 0.0011 0.0116 0.0027 0.0089 0.0513 0.2895 0.1442 0.1376 0.5795 0.0210 0.1537 0.0035 0.0596 0.1268 0.0533 0.0122 0.0005 0.0354 0.5993 0.1035 1.5536 13.0609 7.8456 0.1906 60.2217 2.9632 0.0028 29.1699 6.9705 6.6072 34.1561 11.6055 11.1186 40.3370 1.3575 0.5398 10.3183 7.6526 13.5820 49.2454 47.5478 42.5818 9.2856 8.7465 19.5998 54.4131 174.3180 9.5984 34.8414 134.6024 65.4132 0.0358 5.3530 14.0557 7.7518 0.1804 1.7399
temp: 298.150 k
press: 1.00000 atm
elementType: 17 17 17 17 17 17 17 17 6 6 6 6 6 6 6 6 6 6 6 6 1 1
symmnumber: 1
zpe: 264155.9 jmol-1
zpe.correction: 0.100612 hartree
zpe.thermalcorrener: 0.120333 hartree
zpe.thermalcorrenthalpy: 0.121277 hartree
zpe.thermalcorrgfe: 0.048490 hartree
zpe.sumelectzpe: -4137.535359 hartree
zpe.sumelectthermal: -4137.515638 hartree
zpe.sumelectthermalent: -4137.514694 hartree
zpe.sumelectthermalfe: -4137.587481 hartree
dipole: -0.0746 0.0000 0.0143
dipole: 0.0760
quadrupole: -174.2454 -171.0953 -166.5329
quadrupole: -0.0003 4.5611 -0.0003
quadrupole: -3.6209 -0.4708 4.0916 -0.0003 4.5611 -0.0003
hfenergy: -4137.6359707 hartree
pointgroup: C01 [X(C12H2Cl8)]
dipole: -0.0292322 -0.000018 0.006265 debye
dipolederiv: -0.2474267 0.2675422 -0.0161737 0.2695416 -0.5037438 0.0179081 -0.0104162 0.0181319 0.0042459 -0.2474379 -0.2675418 -0.0161409 -0.26955 -0.5037362 -0.0178455 -0.0103905 -0.0180803 0.0042493 -0.3083452 0.0000173 0.2551837 0.0000059 -0.0270559 -0.000015 0.2849153 -0.0000301 -0.5686407 -0.2166369 0.2860635 -0.0144539 0.3357136 -0.494356 0.0204134 -0.0151559 0.019286 0.0172064 -0.216647 -0.2860717 -0.0144216 -0.335716 -0.4943464 -0.0203538 -0.0151161 -0.019221 0.0172109 -0.7285239 0.0000038 -0.0457281 -0.0000001 -0.0008651 0.0000009 -0.048249 0.0000019 0.016995 -0.2807709 0.000004 0.2717698 0.0000088 -0.017619 -0.0000138 0.3825628 -0.0000104 -0.5529045 -0.8297684 0.0000464 -0.0328972 0.0000634 -0.0156557 0.0000004 -0.0776868 0.0000032 -0.0609444 0.2597855 -0.000007 0.0475705 0.0000047 -0.2905228 0.0000151 0.0783989 0.0000101 0.0145223 0.219794 0.0000089 0.1295494 0.000004 -0.0012172 -0.000003 0.0881593 -0.000004 -0.1417446 0.2256513 -0.4563104 0.0152002 -0.4661557 0.6297242 -0.0356273 0.0137559 -0.0409193 -0.0280632 0.225661 0.4563201 0.0151468 0.4661659 0.6297104 0.0355414 0.0137135 0.0408608 -0.0280726 0.329043 -0.0000318 -0.4558956 -0.000022 -0.0456158 0.0000299 -0.3051213 0.0000475 0.8531088 -0.1640051 -0.0000044 0.1002531 -0.0000144 -0.0376655 -0.0000031 -0.042354 0.0000072 -0.1317212 -0.0209359 -0.5429914 -0.0018838 -0.6030846 0.6078863 -0.0353211 -0.0048195 -0.0373803 -0.0260444 -0.0209183 0.5430028 -0.0019434 0.6030968 0.6078721 0.0352535 -0.0048923 0.0372914 -0.0260529 1.0129931 -0.0000067 0.0603682 -0.0000057 -0.2041314 0.0000091 0.0674813 0.0000129 -0.0183125 0.0770551 0.000016 -0.5678207 0.0000282 -0.043144 0.0000149 -0.56597 0.0000077 0.793919 -0.412242 0.0000284 0.1123421 0.0000301 -0.037228 -0.0000048 0.1101416 -0.0000164 -0.2039912 1.2018221 -0.000091 0.2119312 -0.0001233 -0.050003 0.0000005 0.139777 0.0000076 -0.0057481 0.0793193 -0.0000003 -0.0357692 -0.0000076 0.1317333 0.0000026 -0.0623424 -0.0000037 0.0266328 0.0625338 0.0000031 -0.0161869 0.0000164 0.1599794 -0.0000025 -0.0163916 -0.0000026 0.04415 unknown
polarizability: 300.9476027|-0.0032334|186.640796|-11.6300263|-0.0042679|149.0313907 unknown
InChI: InChI=1S/C12H2Cl8/c13-4-2-6(15)5(14)1-3(4)7-8(16)10(18)12(20)11(19)9(7)17/h1-2H
charge 0 multiplicity 1
22 atoms
Cl -0.359375 -2.771216 0.003602
Cl -0.359327 2.771234 0.003235
Cl 0.710806 0.000152 2.86146
Cl -3.571401 2.782898 -0.202538
Cl -3.571462 -2.782845 -0.202222
Cl -5.175618 0.000023 -0.302716
Cl 4.065221 -0.00007 -2.613644
Cl 5.600796 -0.000194 0.297507
C  -0.535088 0.000006 -0.012887
C  0.9607 0.000011 0.071606
C  -1.265243 -1.213149 -0.059184
C  -1.265221 1.213171 -0.059362
C  1.646556 0.000085 1.309819
C  1.732736 -0.000053 -1.114129
C  -2.676196 1.225557 -0.14675
C  -2.676223 -1.225517 -0.146609
C  -3.382875 0.00002 -0.190642
C  3.139725 -0.000048 -1.063143
C  3.051504 0.000036 1.379938
C  3.799779 -0.000046 0.185748
H  1.232038 -0.000092 -2.086621
H  3.562369 0.000036 2.346132
