program: Gaussian 09
title: 000040512
version: EM64L-G09RevD.01
frameworkgroup: C1[X(C10H20N2O3)]
method: RPBEPBE
basis: SDD
operation: Freq
keyword: #p
keyword: freq=noraman
keyword: PBEPBE/SDD
title: #p freq=noraman PBEPBE/SDD
converged: YES YES NO NO
title: Mulliken charges:
elementType: O O O N N C C C C C C C C C C H H H H H H H H H H H H H H H H H H H H
charge: -0.260426 -0.287821 -0.247448 -0.053501 0.038869 -0.421124 -0.353973 -0.381325 -0.330705 -0.375774 -0.343025 -0.285730 -0.688227 0.292436 -0.754376 0.215268 0.252822 0.203760 0.241511 0.242203 0.211012 0.192551 0.212906 0.221689 0.206844 0.202904 0.193725 0.234885 0.229044 0.209869 0.221595 0.215590 0.249163 0.246070 0.248740
chargesum: 0.00000
title: Mulliken charges with hydrogens summed into heavy atoms:
elementType: O O O N N C C C C C C C C C C
charge: -0.260426 -0.287821 -0.247448 -0.053501 0.038869 0.046966 0.091298 0.071890 0.074753 0.052759 0.053603 0.178199 -0.041174 0.292436 -0.010404
polarizability: 1.61225523e+02 -2.09590418e+00 1.36109175e+02 -9.05822700e-01 -4.19283081e+00 1.11927001e+02
1716.lowfreq: -12.0250 -3.3704 0.0005 0.0006 0.0007 3.7798 18.8151 21.0093 33.8800
frequency: 18.6494 20.7386 33.8728 38.9527 46.3432 53.7301 69.9702 84.6858 96.9172 113.1682 121.8958 160.7720 184.7176 193.2284 226.0483 249.2093 284.5150 306.6938 335.6400 358.1811 405.9759 410.9674 448.3916 519.8209 570.4199 613.1105 672.9998 739.4058 741.9921 782.8811 788.1317 831.2900 846.2018 899.4612 908.9565 922.2974 942.9023 1001.4662 1002.4912 1024.3108 1035.2837 1045.6089 1054.2502 1072.7914 1098.5121 1099.5370 1114.9200 1158.1476 1192.7432 1200.9339 1226.2767 1240.1304 1254.5492 1267.4804 1272.5362 1285.6930 1291.3618 1302.4118 1324.4472 1329.6967 1343.0916 1348.5870 1361.0174 1366.4111 1373.8433 1385.7164 1391.0116 1434.7015 1455.4093 1456.8303 1457.0943 1468.2047 1468.7975 1473.4930 1476.7697 1477.2718 1486.9138 1487.5441 1646.9649 2966.7573 2970.6857 2976.2487 2979.0954 2986.2567 2987.9912 2997.5915 3003.5262 3006.4795 3010.5728 3034.7374 3038.2675 3049.6405 3066.1504 3068.7227 3074.2832 3077.6813 3081.3778 3099.6482 3138.6522
redmass: 4.7070 3.5556 1.1028 2.4670 3.6645 4.0154 2.0946 3.3386 2.5038 2.3859 2.4492 3.5075 5.2378 2.9871 1.1604 3.2455 3.4438 5.0002 4.1599 2.8322 3.7572 3.7919 3.3399 4.4144 3.1529 4.8143 3.0134 1.0762 1.1863 1.2246 1.2486 6.1590 4.3018 1.7393 1.5090 1.3284 5.6357 2.6023 1.9979 3.1141 3.7449 1.6539 3.2708 2.4831 1.7679 2.9682 2.1533 1.3871 1.9331 3.6297 1.7632 1.5564 1.2766 1.4039 1.2778 1.1805 1.0723 1.3183 2.1841 1.4435 1.3881 1.5409 1.5473 1.3936 1.4974 1.2801 1.2132 1.0997 1.0604 1.0537 1.0808 1.0733 1.0696 1.0862 1.0631 1.0452 1.0921 1.0867 9.9860 1.0593 1.0628 1.0390 1.0601 1.0600 1.0594 1.0591 1.0573 1.0382 1.0987 1.0990 1.1002 1.1024 1.1009 1.1057 1.1012 1.0994 1.1064 1.0942 1.1025
irintensity: 2.3506 0.7009 0.9533 0.4231 2.2901 0.9628 0.4226 1.1953 2.4820 0.6822 1.4570 1.0139 4.5349 8.0474 0.2621 0.8294 3.4770 4.1043 10.3039 2.0298 0.4881 2.9394 2.3493 6.5594 3.3062 5.4712 1.9801 9.1045 14.7198 0.6988 2.2414 20.2583 16.2285 12.1398 16.1558 24.0776 38.6292 56.6249 71.4133 53.9379 41.8766 14.8207 2.0208 1.5387 4.6344 12.0848 8.6646 0.7977 26.2197 396.1042 1.3849 18.9507 17.9442 9.9615 0.9638 9.1915 1.6194 30.5074 56.4144 21.3258 12.3082 4.3794 3.3867 2.5583 10.2211 42.4945 12.1174 13.3008 18.0212 16.7872 5.1253 1.0232 0.9614 0.8268 5.0041 12.5899 24.4818 14.6227 201.3125 10.4150 11.6364 26.5098 90.4817 8.2934 1.1403 20.7485 57.3063 5.1896 3.9420 1.3826 16.9103 0.3474 4.0787 1.6738 89.6273 51.8374 73.1661 9.4044 9.2389
temp: 298.150 k
press: 1.00000 atm
elementType: 8 8 8 7 7 6 6 6 6 6 6 6 6 6 6 1 1 1 1 1 1 1 1 1 1 1 1 1 1 1 1 1 1 1 1
symmnumber: 1
zpe: 777050.8 jmol-1
zpe.correction: 0.295963 hartree
zpe.thermalcorrener: 0.314897 hartree
zpe.thermalcorrenthalpy: 0.315841 hartree
zpe.thermalcorrgfe: 0.243901 hartree
zpe.sumelectzpe: -726.959163 hartree
zpe.sumelectthermal: -726.940229 hartree
zpe.sumelectthermalent: -726.939285 hartree
zpe.sumelectthermalfe: -727.011224 hartree
dipole: -0.9826 3.2353 -3.8874
dipole: 5.1522
quadrupole: -84.8099 -107.3132 -95.3593
quadrupole: -14.8354 -4.4901 2.2541
quadrupole: 11.0175 -11.4857 0.4682 -14.8354 -4.4901 2.2541
hfenergy: -727.2551256 hartree
pointgroup: C01 [X(C10H20N2O3)]
dipole: -0.2888885 -1.4097636 1.42756 debye
polarizability: 161.1332229|1.7390485|136.663031|-2.5943115|-1.9826896|111.4654446 unknown
InChI: InChI=1S/C10H20N2O3/c1-3-4-7-12(11-14)8-5-6-9-15-10(2)13/h3-9H2,1-2H3
charge 0 multiplicity 1
35 atoms
O  3.758656 -0.113157 0.186186
O  -1.711959 3.321671 -0.36948
O  4.62398 -1.044188 -1.76742
N  -2.346513 1.361081 0.527975
N  -2.689844 2.499373 -0.181771
C  -0.976474 1.156149 1.046894
C  0.019261 0.643946 -0.022854
C  -3.4474 0.411585 0.774628
C  -3.253231 -0.964911 0.098751
C  1.441553 0.504052 0.566648
C  -4.455344 -1.901613 0.359736
C  2.427478 -0.010082 -0.482698
C  -4.274926 -3.290113 -0.290486
C  4.793071 -0.648824 -0.591455
C  6.098639 -0.647328 0.173987
H  -1.041051 0.447538 1.892517
H  -0.620601 2.134397 1.424719
H  -0.326391 -0.331456 -0.416727
H  0.026917 1.358301 -0.86662
H  -4.36031 0.90059 0.390221
H  -3.569075 0.273144 1.86855
H  -2.329574 -1.447435 0.477396
H  -3.120368 -0.820195 -0.991241
H  1.790969 1.484044 0.943755
H  1.435052 -0.192672 1.427714
H  -5.379714 -1.427602 -0.027506
H  -4.5994 -2.020962 1.453247
H  2.518754 0.678944 -1.342779
H  2.148003 -1.007288 -0.870381
H  -3.375323 -3.799629 0.102988
H  -5.145243 -3.941813 -0.093376
H  -4.159393 -3.203221 -1.386963
H  6.677665 0.254749 -0.096547
H  6.695461 -1.527836 -0.111135
H  5.923775 -0.63374 1.260125
