program: Gaussian 09
title: 000040503
version: EM64L-G09RevD.01
frameworkgroup: C1[X(C20H21NO3)]
method: RPBEPBE
basis: SDD
operation: Freq
keyword: #p
keyword: freq=noraman
keyword: PBEPBE/SDD
title: #p freq=noraman PBEPBE/SDD
converged: YES YES NO NO
title: Mulliken charges:
elementType: O O O N C C C C C C C C C C C C C C C C C C C C H H H H H H H H H H H H H H H H H H H H H
charge: -0.262170 -0.197685 -0.209096 -0.111044 0.253322 -0.530620 0.168440 0.264229 0.163568 -0.303768 -0.309923 -0.188012 0.278280 0.250445 -0.222462 -0.432764 -0.374819 -0.686249 -0.673989 -0.384660 -0.372783 -0.228656 -0.229219 -0.537232 0.256354 0.245809 0.180043 0.220158 0.183300 0.200057 0.290267 0.249859 0.207177 0.204338 0.229282 0.243159 0.193526 0.216880 0.286420 0.288912 0.237634 0.238304 0.226246 0.228322 0.250822
chargesum: 0.00000
title: Mulliken charges with hydrogens summed into heavy atoms:
elementType: O O O N C C C C C C C C C C C C C C C C C C C C
charge: -0.262170 -0.197685 -0.209096 -0.111044 0.253322 -0.028457 0.168440 0.264229 0.163568 0.096434 0.073434 -0.188012 0.278280 0.250445 -0.222462 -0.142497 -0.124961 -0.045453 -0.020423 -0.098240 -0.083871 0.008977 0.009085 0.168158
polarizability: 3.49493771e+02 1.48947861e+01 2.73468517e+02 2.01502574e+01 -2.09779686e+01 1.44609057e+02
1716.lowfreq: -10.9957 -7.8276 -4.8579 0.0005 0.0006 0.0008 10.8576 21.6267 35.2424
frequency: 9.4641 21.5796 35.2121 57.0536 62.0602 72.5790 87.0114 101.0786 123.6157 139.3210 158.5186 167.1244 179.0274 183.9693 214.0492 229.0009 256.5213 264.7179 284.3006 296.6727 321.9149 328.2200 338.7283 356.8372 395.4519 407.3658 416.2520 433.2921 438.8292 461.9246 470.1186 502.4924 538.2440 551.4887 589.7649 618.3054 653.7226 661.2816 678.4512 710.9352 724.0751 726.6415 763.0230 789.6282 794.4951 798.9210 803.6662 832.1542 858.7589 871.4001 903.9049 922.9535 933.8336 969.9691 972.9735 985.5919 991.6647 997.6719 1011.4755 1031.5186 1054.4471 1060.2050 1071.3808 1086.9139 1089.2459 1109.7985 1112.8786 1143.9427 1157.2895 1170.0577 1172.1705 1188.8382 1189.4885 1191.7228 1231.1215 1244.2923 1264.9549 1279.9601 1283.6790 1287.4707 1313.4245 1358.1539 1363.1336 1365.8331 1378.3509 1386.3562 1393.1237 1399.3651 1425.0690 1431.9382 1440.5263 1454.3018 1457.2913 1461.1784 1465.8510 1467.9939 1468.8824 1469.3929 1472.4875 1474.8913 1483.4190 1489.1110 1531.0225 1550.2644 1565.1165 1591.9980 1598.6570 1613.2115 2846.7061 2856.8015 2938.3753 2967.9928 2981.5703 2986.5332 3033.0994 3037.9104 3060.6326 3073.6170 3079.6616 3090.1442 3091.6575 3100.2021 3130.7511 3135.4512 3151.0166 3151.7455 3162.9514 3170.8903 3171.9151
redmass: 2.6550 4.8187 5.2119 2.2832 3.4211 2.4192 4.5719 2.9005 4.7440 3.6922 3.5869 4.0682 1.5352 3.4243 1.4830 1.2681 3.9314 2.7607 4.0049 2.7473 3.3097 5.0740 3.6353 4.2232 4.8734 3.9282 4.2736 2.9895 4.7157 3.1546 7.6786 4.3322 5.1051 4.5826 5.0885 5.1730 5.8554 6.8205 4.1963 4.1700 3.0565 4.1972 3.4755 1.6384 1.3430 1.6208 1.8588 2.2452 2.4521 5.7425 2.1608 1.7179 3.9718 2.6612 2.7925 1.3770 1.4153 3.3535 1.3576 2.3567 2.7160 2.7062 2.0533 2.0535 2.2489 1.2584 2.0103 1.3947 2.0871 1.1898 1.5461 2.0626 2.0566 2.2943 3.2561 2.1701 1.3223 1.4039 1.3239 1.5933 3.3993 1.3194 2.0429 1.4085 2.4438 1.2422 1.2209 9.8225 4.0517 1.5465 2.0152 1.6510 1.2876 1.0563 1.0683 1.1323 1.8347 1.1564 1.1614 1.0668 1.0705 1.0681 9.8618 7.8392 7.2320 6.6906 8.4630 7.3022 1.0723 1.0716 1.0705 1.0326 1.0358 1.0370 1.0865 1.0868 1.1044 1.0979 1.0982 1.1001 1.0883 1.0992 1.1001 1.0862 1.0901 1.0879 1.0946 1.0965 1.0997
irintensity: 0.0108 2.1244 2.9749 1.4058 0.6087 0.4640 1.6327 4.1403 1.4942 7.3908 2.1111 0.9444 0.8232 0.1689 0.7514 0.2589 2.7737 0.8174 0.3513 0.8625 0.7522 1.3184 0.3865 8.6393 8.2336 4.8189 0.6678 6.0932 4.5235 3.4717 0.5048 8.4041 8.9434 3.6303 16.1851 2.0851 4.6391 1.5189 4.3329 28.3589 44.5486 23.4731 9.2090 2.3898 10.5725 15.7060 2.8425 33.0269 12.1520 5.7236 29.7218 1.3753 39.5090 31.3054 5.0052 0.3814 6.3498 36.2783 0.3728 7.5186 25.9156 52.7812 18.1320 1.2041 8.0860 0.0964 6.4592 11.0350 29.0502 1.2687 18.4796 5.4474 3.6809 15.7757 56.8530 167.9337 38.4509 138.9390 64.6685 137.1066 426.1210 7.3934 3.6404 12.4900 1.6512 20.7763 16.8348 0.6135 34.1187 3.5269 1.8549 11.9144 10.7041 8.2959 15.8575 11.5201 19.9185 23.5333 22.0092 13.5401 19.4378 15.0669 99.2588 208.5343 36.8337 49.2406 7.1072 9.5092 32.6214 213.9089 62.2772 73.9408 34.2276 34.9495 9.2586 26.4862 36.8398 45.1059 59.8324 45.9241 1.6871 36.8874 18.7492 3.8985 8.7374 0.5624 2.7543 26.4585 18.2175
temp: 298.150 k
press: 1.00000 atm
elementType: 8 8 8 7 6 6 6 6 6 6 6 6 6 6 6 6 6 6 6 6 6 6 6 6 1 1 1 1 1 1 1 1 1 1 1 1 1 1 1 1 1 1 1 1 1
symmnumber: 1
zpe: 950915.4 jmol-1
zpe.correction: 0.362185 hartree
zpe.thermalcorrener: 0.384924 hartree
zpe.thermalcorrenthalpy: 0.385869 hartree
zpe.thermalcorrgfe: 0.308132 hartree
zpe.sumelectzpe: -1053.401415 hartree
zpe.sumelectthermal: -1053.378675 hartree
zpe.sumelectthermalent: -1053.377731 hartree
zpe.sumelectthermalfe: -1053.455468 hartree
dipole: -2.9276 -0.7001 0.9116
dipole: 3.1451
quadrupole: -114.7273 -135.4938 -146.6068
quadrupole: 22.0218 0.8317 3.2271
quadrupole: 17.5487 -3.2178 -14.3309 22.0218 0.8317 3.2271
hfenergy: -1053.7635995 hartree
pointgroup: C01 [X(C20H21N1O3)]
dipole: 1.1321703 -0.45047 -0.2154011 debye
polarizability: 339.1006298|-21.163342|280.586438|41.7801346|1.4055947|147.8842772 unknown
InChI: InChI=1S/C20H21NO3/c1-4-21(5-2)12-16-17(24-3)11-10-15-18(16)20(23)14-9-7-6-8-13(14)19(15)22/h6-11H,4-5,12H2,1-3H3
charge 0 multiplicity 1
45 atoms
O  3.441018 -1.795075 1.204753
O  -0.307876 1.841124 1.50886
O  -2.724435 -2.63608 -0.445109
N  2.472333 1.533465 -0.163971
C  1.457074 -0.483741 0.911275
C  2.327785 0.752507 1.109477
C  0.057874 -0.413189 0.64632
C  -0.673207 -1.59816 0.294717
C  2.071171 -1.776443 0.918747
C  3.249948 0.789347 -1.195083
C  3.047107 2.88357 0.110214
C  -0.719566 0.865759 0.807155
C  -2.083412 0.937926 0.187663
C  -2.755931 -0.23283 -0.258952
C  -2.098833 -1.5670 -0.141892
C  -0.024071 -2.853776 0.308055
C  1.333339 -2.955916 0.639297
C  3.007483 1.318973 -2.621099
C  2.015764 3.891983 0.648364
C  -2.730125 2.195112 0.09551
C  -4.064437 -0.137329 -0.792974
C  -4.025451 2.287229 -0.452482
C  -4.695196 1.118094 -0.897096
C  4.134312 -3.088004 1.222411
H  1.848315 1.412942 1.846393
H  3.320363 0.440232 1.501863
H  4.346232 0.792588 -0.96373
H  2.929251 -0.267206 -1.158725
H  3.91194 2.808655 0.818592
H  3.456058 3.272494 -0.83972
H  -0.614172 -3.737488 0.045853
H  1.815167 -3.937119 0.654439
H  3.347519 2.362961 -2.746115
H  3.553968 0.700826 -3.358088
H  1.929644 1.282394 -2.857284
H  1.536031 3.540378 1.576837
H  2.504755 4.863201 0.854648
H  1.214115 4.048641 -0.094218
H  -2.20017 3.079544 0.461923
H  -4.559513 -1.059413 -1.113467
H  -4.517623 3.262509 -0.532328
H  -5.704079 1.192216 -1.317068
H  4.082349 -3.585896 0.235522
H  3.718902 -3.754352 2.002027
H  5.17928 -2.843454 1.461285
