program: Gaussian 09
title: 000040510
version: EM64L-G09RevD.01
frameworkgroup: C1[X(C20H21NO)]
method: RPBEPBE
basis: SDD
operation: Freq
keyword: #p
keyword: freq=noraman
keyword: PBEPBE/SDD
title: #p freq=noraman PBEPBE/SDD
converged: YES YES NO NO
title: Mulliken charges:
elementType: O N C C C C C C C C C C C C C C C C C C C C H H H H H H H H H H H H H H H H H H H H H
charge: -0.276922 -0.099725 -0.368272 -0.340070 -0.436998 -0.451214 -0.554979 0.216197 0.207250 0.143530 0.477367 -0.618774 0.410711 -0.505887 -0.375749 -0.714044 0.398429 -0.442563 -0.424415 -0.245921 -0.247706 -0.537825 0.221094 0.177805 0.187635 0.231656 0.206711 0.224742 0.227712 0.203576 0.251663 0.220620 0.294708 0.240085 0.237407 0.244470 0.243948 0.238200 0.225022 0.225149 0.220914 0.220327 0.244137
chargesum: 0.00000
title: Mulliken charges with hydrogens summed into heavy atoms:
elementType: O N C C C C C C C C C C C C C C C C C C C C
charge: -0.276922 -0.099725 0.030627 0.079222 -0.005545 -0.019926 -0.082697 0.216197 0.207250 0.143530 0.477367 -0.324066 0.410711 -0.265802 -0.138342 -0.469574 0.398429 -0.198615 -0.186215 -0.020899 -0.022557 0.147553
polarizability: 3.57829878e+02 -4.81141294e+01 2.60874819e+02 -1.15002232e+01 -2.53642878e+01 1.33226317e+02
1716.lowfreq: -8.2424 -0.0006 0.0002 0.0005 2.4429 5.3057 28.4389 40.4853 47.1583
frequency: 28.1850 40.3396 47.1503 51.5663 75.9506 91.1790 100.0862 136.0371 143.1150 173.1666 219.3073 230.7705 248.7170 276.6591 286.0807 315.1546 324.5855 340.6951 357.9631 404.7620 408.4440 470.2266 502.4153 520.3230 522.8581 540.4978 562.8053 609.9664 617.8365 630.0520 639.3853 658.6066 719.6698 740.5702 750.5975 751.1832 773.6025 783.7167 796.5898 803.8840 843.7858 854.3826 861.4232 876.9159 893.8802 895.7422 908.8223 926.7883 954.7384 956.8041 966.9041 971.6369 986.3157 986.8283 1012.5329 1027.1841 1057.1310 1074.9229 1093.5988 1109.2358 1120.0545 1128.3843 1136.0879 1145.7182 1168.9529 1185.4993 1187.8866 1189.4357 1193.9312 1212.9089 1222.5689 1224.5934 1233.4525 1264.2062 1280.0418 1284.8011 1289.8275 1290.1048 1307.1301 1317.1137 1341.7931 1364.3420 1377.1407 1402.1798 1417.7355 1431.6247 1438.7796 1441.2559 1458.6658 1464.7295 1470.3813 1472.2183 1474.7501 1479.4462 1480.1761 1484.0050 1495.8810 1551.5391 1563.0117 1584.4589 1628.5636 1635.3014 2833.7579 2858.8841 2918.9894 2959.9423 2982.6361 3008.8115 3018.7995 3028.4279 3048.7730 3052.9593 3065.2225 3090.5096 3112.2491 3116.2015 3119.5790 3122.3592 3125.9181 3139.9807 3150.2751 3159.2259 3164.7971
redmass: 3.3742 3.0928 3.6523 3.3212 1.7823 4.4454 3.9668 4.0912 3.3316 3.2631 2.8401 3.0536 2.0472 2.3067 3.1812 5.8018 2.8398 2.3493 4.0772 3.8497 3.8481 2.4619 5.6855 4.0972 4.2651 3.6156 5.1492 3.4505 6.0737 3.5941 4.0197 3.3338 5.6461 4.4449 1.6732 1.3449 2.8022 3.1327 2.3343 1.7262 1.7946 1.4948 2.1469 3.3304 1.6249 2.5439 3.5526 2.0588 1.4469 2.3953 1.4350 1.6959 1.9774 1.5614 2.3274 2.8711 2.8885 3.1031 1.5613 1.2558 2.6323 2.5126 1.9665 1.4407 1.0899 1.2775 1.3815 1.3835 1.2958 2.1324 1.6282 1.2811 1.6892 1.3614 2.6937 1.2332 1.5098 1.3417 3.2114 1.3705 1.4271 2.2784 1.4635 3.8232 2.2607 2.3396 5.7724 1.9554 2.2938 1.0834 1.0531 1.0806 1.2135 1.0800 1.1183 2.1700 1.1041 5.6698 8.5030 5.6048 6.9492 6.6503 1.0713 1.0713 1.0627 1.0327 1.0953 1.0610 1.0743 1.0744 1.1041 1.0899 1.1041 1.1053 1.0910 1.0858 1.0992 1.0881 1.0888 1.0952 1.0913 1.1003 1.0942
irintensity: 0.1623 0.3048 0.5680 2.5654 0.2668 2.5223 0.0702 3.9220 4.3386 0.1990 0.2591 0.3066 0.0653 0.9908 2.3078 1.3701 3.8180 1.6678 4.5060 0.8620 0.6818 21.5129 4.6062 1.7468 2.5490 0.3905 8.9777 7.5153 4.6509 2.4186 2.9069 3.6360 3.2745 6.5340 5.4124 67.4191 1.2119 0.9461 5.0650 5.2231 9.6304 2.5434 17.0511 2.1093 69.7088 4.8756 5.7916 0.4135 1.5121 10.4199 13.9483 2.8888 8.3501 3.7091 4.6150 15.3980 30.5986 78.8698 0.9623 0.0464 39.7354 13.9411 13.1348 5.1483 0.7619 1.4280 9.8735 6.0104 8.5879 161.3099 26.5893 26.3739 54.3331 22.1133 24.1857 1.8498 6.5462 7.7060 4.3659 18.6749 5.4672 0.9189 25.8194 5.7457 10.1898 11.7848 0.1020 0.3436 56.7097 3.0619 12.0887 14.0172 41.0042 2.1133 14.9032 3.3019 2.0910 17.6003 0.0180 24.9575 80.2160 9.0427 112.6308 104.7727 58.8332 105.7180 18.9377 17.2853 67.4374 68.9531 45.3983 18.9575 1.6670 74.2013 6.9578 6.1258 29.0923 0.1153 7.1160 36.1359 1.4876 53.1140 21.2959
temp: 298.150 k
press: 1.00000 atm
elementType: 8 7 6 6 6 6 6 6 6 6 6 6 6 6 6 6 6 6 6 6 6 6 1 1 1 1 1 1 1 1 1 1 1 1 1 1 1 1 1 1 1 1 1
symmnumber: 1
zpe: 938310.4 jmol-1
zpe.correction: 0.357384 hartree
zpe.thermalcorrener: 0.376394 hartree
zpe.thermalcorrenthalpy: 0.377339 hartree
zpe.thermalcorrgfe: 0.308924 hartree
zpe.sumelectzpe: -903.115691 hartree
zpe.sumelectthermal: -903.096680 hartree
zpe.sumelectthermalent: -903.095736 hartree
zpe.sumelectthermalfe: -903.164150 hartree
dipole: 2.1252 -1.5826 0.4770
dipole: 2.6923
quadrupole: -114.0857 -111.1821 -133.5032
quadrupole: -6.2497 -0.9637 -5.6573
quadrupole: 5.5046 8.4083 -13.9129 -6.2497 -0.9637 -5.6573
hfenergy: -903.4730742 hartree
pointgroup: C01 [X(C20H21N1O1)]
dipole: -0.769011 -0.7281576 -0.0198338 debye
polarizability: 341.1714368|54.8305289|276.1850122|-40.1624422|-1.2342519|134.5745653 unknown
InChI: InChI=1S/C20H21NO/c1-22-20-9-8-17-12-15-6-2-3-7-16(15)13-18(17)19(20)14-21-10-4-5-11-21/h2-3,6-9,12-13H,4-5,10-11,14H2,1H3
charge 0 multiplicity 1
43 atoms
O  -3.100482 -2.089107 1.095116
N  -2.179282 1.54456 0.305078
C  -2.954057 2.703647 0.818907
C  -2.895074 1.126088 -0.928703
C  -3.299896 3.51482 -0.458905
C  -3.208325 2.47303 -1.62793
C  -1.977194 0.473186 1.315521
C  -1.165804 -0.70589 0.797671
C  0.222613 -0.547156 0.415528
C  -1.740738 -1.98572 0.729955
C  1.002109 -1.712715 0.00184
C  0.864517 0.71966 0.431444
C  2.227817 0.87012 0.077115
C  0.356855 -2.995482 -0.035355
C  -0.979949 -3.134671 0.312196
C  2.365962 -1.561673 -0.351361
C  3.005409 -0.299747 -0.320932
C  2.878917 2.156888 0.090233
C  4.391654 -0.128185 -0.677139
C  4.219269 2.285625 -0.260545
C  4.985682 1.129674 -0.647699
C  -3.733478 -3.408488 1.060966
H  -2.358758 3.27804 1.552402
H  -3.895176 2.371517 1.330663
H  -3.841989 0.580188 -0.684727
H  -2.26341 0.454119 -1.534301
H  -4.302656 3.970473 -0.381143
H  -2.572672 4.330238 -0.613052
H  -2.389845 2.743645 -2.316512
H  -4.140501 2.415484 -2.216812
H  -2.952332 0.096479 1.699808
H  -1.440208 0.931985 2.171198
H  0.269657 1.604991 0.676345
H  0.937552 -3.87216 -0.345823
H  -1.449217 -4.121808 0.271752
H  2.938255 -2.447135 -0.657213
H  2.294069 3.036736 0.383985
H  4.972404 -1.010031 -0.974497
H  4.701742 3.269317 -0.245145
H  6.040098 1.249977 -0.92039
H  -3.241334 -4.115627 1.756651
H  -3.736326 -3.833274 0.03845
H  -4.76928 -3.232519 1.387859
