program: Gaussian 09
title: 000040466
version: EM64L-G09RevD.01
frameworkgroup: C1[X(C7H7ClN4O2)]
method: RPBEPBE
basis: SDD
operation: Freq
keyword: #p
keyword: freq=noraman
keyword: PBEPBE/SDD
title: #p freq=noraman PBEPBE/SDD
converged: NO YES YES YES
title: Mulliken charges:
elementType: Cl O O N N N N C C C C C C C H H H H H H H
charge: -0.062419 -0.224739 -0.125347 -0.086131 -0.320503 -0.664608 0.132762 0.253770 -0.351454 -0.351467 -0.187077 -0.187078 -0.122745 0.270130 0.253515 0.253510 0.255734 0.255732 0.330405 0.363560 0.314449
chargesum: 0.00000
title: Mulliken charges with hydrogens summed into heavy atoms:
elementType: Cl O O N N N N C C C C C C C
charge: -0.062419 -0.224739 -0.125347 -0.086131 0.009903 0.013401 0.132762 0.253770 -0.097939 -0.097957 0.068657 0.068654 -0.122745 0.270130
polarizability: 2.19573669e+02 4.88139593e+00 8.54765925e+01 2.50318416e-03 1.04555690e-02 8.95297000e+01
1716.lowfreq: -111.7128 -36.4246 -4.4658 -3.0135 -0.0015 -0.0013 -0.0010 7.9220 39.2619
frequency: -111.6876 -36.4230 39.2555 44.9440 120.6944 131.1371 162.9703 181.8331 262.1685 296.3174 313.9249 377.2546 405.3681 406.6539 446.5682 462.5678 498.9017 525.5431 590.3862 622.6986 637.9882 650.7897 668.3361 699.3808 728.7214 771.4000 814.8488 823.4136 908.2068 935.4245 951.2669 991.5665 1014.9879 1043.1654 1070.0565 1099.6236 1144.2650 1174.6608 1243.1116 1284.7891 1297.4024 1345.6850 1372.7676 1396.7496 1468.5409 1532.0963 1568.7906 1594.9203 1619.0012 1681.9699 3150.7050 3151.2456 3171.7144 3175.4350 3538.5536 3555.0809 3680.4361
redmass: 2.4393 4.5648 11.4093 10.2038 10.2310 5.9207 7.3662 1.7365 5.8261 11.7397 5.3267 5.5636 2.9854 10.9773 3.1211 1.3680 3.0058 1.1457 5.9537 7.1670 5.4020 7.4645 13.6217 4.5082 5.6098 5.9032 1.2435 1.7009 4.7019 1.3114 1.3472 4.4763 4.6577 1.7936 2.6368 1.3366 11.0794 1.1136 3.6501 1.2578 2.4087 5.2662 5.7751 3.9351 2.4795 2.3646 7.8435 6.1660 1.1839 7.0041 1.0887 1.0885 1.0964 1.0975 1.0464 1.0778 1.1047
irintensity: 11.0908 2.4793 0.1221 3.4367 1.5638 0.7322 0.6603 26.4264 0.0043 1.9513 0.2664 3.0289 0.6136 7.0074 31.2985 130.5534 30.0755 195.1904 7.1345 0.1150 30.9844 2.7697 9.9276 1.5830 20.2192 8.1800 0.7119 61.7168 45.4748 0.8254 0.1866 78.1301 102.1031 15.3366 49.5647 13.7552 659.1189 4.7586 30.1651 0.0067 3.4237 0.9869 298.1570 0.2924 155.4541 200.3355 0.2497 18.5700 80.7401 708.8214 1.3498 7.2394 7.8237 0.0535 36.9223 63.2344 45.9693
temp: 298.150 k
press: 1.00000 atm
elementType: 17 8 8 7 7 7 7 6 6 6 6 6 6 6 1 1 1 1 1 1 1
symmnumber: 1
zpe: 375904.3 jmol-1
zpe.correction: 0.143174 hartree
zpe.thermalcorrener: 0.155067 hartree
zpe.thermalcorrenthalpy: 0.156011 hartree
zpe.thermalcorrgfe: 0.103699 hartree
zpe.sumelectzpe: -1099.325033 hartree
zpe.sumelectthermal: -1099.313140 hartree
zpe.sumelectthermalent: -1099.312196 hartree
zpe.sumelectthermalfe: -1099.364508 hartree
dipole: 0.1502 6.3585 -0.0023
dipole: 6.3602
quadrupole: -112.3927 -82.8597 -80.7141
quadrupole: 16.4475 -0.0069 0.0046
quadrupole: -20.4039 9.1291 11.2747 16.4475 -0.0069 0.0046
hfenergy: -1099.468207 hartree
pointgroup: C01 [X(C7H7Cl1N4O2)]
dipole: -0.0234373 -2.5022002 -0.0021428 debye
dipolederiv: -0.940379 -0.0255379 -0.0000225 0.0150027 -0.0715708 0.0000674 0.0000058 0.0000658 -0.1324854 -1.3063683 0.0290962 0.0001634 -0.110369 -0.4533972 -0.0001621 0.0003501 -0.0001869 -0.2363325 -0.4615911 -0.1009998 0.0000009 0.0992305 -0.7465169 -0.0004727 0.0001967 -0.0005585 -0.1400615 -1.9386528 -0.3231957 -0.0002539 -0.2130221 -0.6566825 -0.0003279 -0.0002178 -0.0002518 -0.2847347 -1.5668164 0.4084362 0.0004939 0.8151027 -0.7738179 -0.0005058 0.000687 -0.0004901 -0.3336139 -0.5709667 0.3096512 0.0002169 -0.2337463 -1.1147517 -0.0005509 -0.0003435 -0.0006559 -0.6402758 2.1366193 -0.2433011 -0.000604 -0.9049363 1.6398705 0.0013075 -0.0014735 0.0013108 0.2181684 1.6355279 0.2330054 0.000184 -0.02708 0.0069726 -0.0000486 0.0000107 -0.0000594 0.0473874 -0.332812 -0.0618863 -0.0197872 -0.048575 -0.1559524 -0.0277132 0.1747059 -0.0061669 0.0447946 -0.332799 -0.0619446 0.0197039 -0.0483516 -0.1560569 0.0272904 -0.1748183 0.0057297 0.0448477 -0.1788779 -0.0111698 0.0167211 -0.0124549 -0.0959295 -0.0060644 -0.0044743 0.0103369 0.0538855 -0.1788858 -0.0111256 -0.0167658 -0.0124332 -0.0959143 0.0057319 0.0044514 -0.0106782 0.053882 1.2159593 0.0090798 0.0000171 -0.0121791 -0.0950466 -0.0001066 -0.0000085 -0.0000994 0.0001571 2.1975302 -0.1613176 -0.0001839 0.5529075 1.5167604 0.0011231 0.000579 0.0011085 0.2917014 0.0342964 0.0115449 -0.0814196 0.0165386 0.152151 0.0044221 -0.0727624 0.0005144 -0.015908 0.0342744 0.0113657 0.0814472 0.016379 0.1521575 -0.004051 0.07281 -0.0001486 -0.015932 0.0357736 -0.0065633 0.0707451 0.0011188 0.1613184 0.0021224 0.0686528 0.0029131 -0.0052759 0.0357744 -0.0064081 -0.0707544 0.0012892 0.1613281 -0.0017528 -0.0686514 -0.0025445 -0.0052906 0.1083242 0.0470297 0.0000727 0.0882787 0.1786451 -0.0001475 0.0001619 -0.0001235 0.3472024 0.1971833 -0.0163887 -0.0000104 0.0871219 0.2478219 -0.00003 0.0000715 0.0000242 0.3115952 0.176886 -0.0293707 0.0000355 -0.0698219 0.1986111 -0.0001313 0.0000669 -0.0000397 0.3962886 unknown
polarizability: 219.4072298|6.791125|85.6430434|-0.0024455|-0.012596|89.5296887 unknown
InChI: InChI=1S/C7H7ClN4O2/c8-5-1-3-6(4-2-5)10-7(9)11-12(13)14/h1-4,11H,9H2
charge 0 multiplicity 1
21 atoms
Cl 5.345133 0.141089 0.000116
O  -4.980673 0.151974 0.00073
O  -3.195599 1.60169 0.001522
N  -0.719898 0.26806 0.000163
N  -2.890006 -0.720137 -0.000645
N  -1.025996 -2.118317 -0.00192
N  -3.717964 0.443648 0.000539
C  0.697366 0.182842 0.000108
C  1.420095 0.183985 -1.226325
C  1.420066 0.181283 1.226559
C  2.83164 0.171643 -1.229185
C  2.831614 0.168939 1.229424
C  3.518793 0.158501 0.000115
C  -1.467453 -0.793409 -0.000723
H  0.87033 0.219384 -2.172265
H  0.870291 0.214603 2.17257
H  3.384553 0.178442 -2.173017
H  3.384507 0.173647 2.173282
H  -3.475213 -1.558367 -0.001279
H  -0.019833 -2.277079 -0.002078
H  -1.643855 -2.92592 -0.00229
