program: Gaussian 09
title: 000005641
version: EM64L-G09RevD.01
frameworkgroup: C1[X(C3H7NO2)]
method: RPBEPBE
basis: SDD
operation: Freq
keyword: #pfreq=noraman
keyword: PBEPBE/SDD
title: #p freq=noraman PBEPBE/SDD
converged: NO NO NO NO
title: Mulliken charges:
elementType: O O N C C C H H H H H H H
charge: -0.299016 -0.286784 -0.618058 -0.215526 -0.673293 0.298810 0.227136 0.227149 0.210568 0.228089 0.228090 0.333831 0.339005
chargesum: 0.00000
title: Mulliken charges with hydrogens summed into heavy atoms:
elementType: O O N C C C
charge: -0.299016 -0.286784 0.054778 0.238759 -0.006546 0.298810
polarizability: 5.98193836e+01 2.23360568e+00 4.83957740e+01 -1.95410934e-03 1.49649486e-03 3.14261586e+01
1716.lowfreq: -3.1764 -0.0006 0.0002 0.0006 9.7673 24.9687 54.0369 131.1143 183.3300
frequency: 53.6928 131.1103 183.3276 251.0002 349.0984 443.7763 486.4373 518.4437 614.3073 706.3318 782.6815 802.7422 954.6502 1047.7356 1056.2340 1113.8405 1140.6014 1250.2896 1298.6317 1377.1949 1400.1103 1463.1544 1478.0302 1492.7082 1585.3032 1678.5661 2993.4447 3003.2841 3059.8807 3089.8547 3105.4884 3559.9381 3719.4556
redmass: 2.5670 2.7482 3.6625 1.1971 3.6816 2.7600 1.1901 1.0453 5.8722 10.8530 3.1538 1.0957 3.1357 2.7528 2.4538 2.1919 1.4602 1.1325 2.3754 1.5804 1.3132 1.0408 1.0495 1.0797 1.2254 7.0257 1.0358 1.0581 1.1069 1.0984 1.1023 1.0442 1.1061
irintensity: 0.6633 12.1760 10.0704 1.1190 9.6567 2.2616 333.6548 7.5175 1.1843 34.5682 13.5821 3.1523 52.7586 69.5453 85.2176 3.1411 5.5342 0.0681 375.7626 65.8385 8.2088 11.4321 5.7834 11.1041 90.9222 381.9599 21.2205 23.3071 13.3417 32.1564 48.3449 56.5530 48.3305
temp: 298.150 k
press: 1.00000 atm
elementType: 8 8 7 6 6 6 1 1 1 1 1 1 1
symmnumber: 1
zpe: 276285.6 jmol-1
zpe.correction: 0.105232 hartree
zpe.thermalcorrener: 0.112352 hartree
zpe.thermalcorrenthalpy: 0.113296 hartree
zpe.thermalcorrgfe: 0.073967 hartree
zpe.sumelectzpe: -323.241693 hartree
zpe.sumelectthermal: -323.234572 hartree
zpe.sumelectthermalent: -323.233628 hartree
zpe.sumelectthermalfe: -323.272958 hartree
dipole: 0.3883 -2.5208 0.0003
dipole: 2.5505
quadrupole: -27.5900 -37.7806 -36.6376
quadrupole: 7.8479 -0.0012 -0.0013
quadrupole: 6.4127 -3.7778 -2.6349 7.8479 -0.0012 -0.0013
hfenergy: -323.3469245 hartree
pointgroup: C01 [X(C3H7N1O2)]
dipole: -0.1796575 0.987228 0.0001026 debye
dipolederiv: -1.7095059 -0.0420653 -0.0000557 0.1472819 -0.5214642 0.0000963 0.0002018 -0.0000048 -0.3165893 -0.710081 0.0980592 -0.0000028 0.1679252 -1.0719009 -0.0001252 -0.0001477 0.0003193 -0.3666047 -0.8731658 -0.4934237 0.000205 -0.5002739 -0.7798633 -0.0000232 0.0000308 -0.0001594 -0.7582513 0.8547401 0.1435104 -0.0000411 0.3143408 0.3247045 -0.0000088 -0.000064 0.0000057 0.3713065 -0.1238529 0.0557228 0.0000147 0.0499789 0.0320128 -0.0000197 0.0000246 -0.0000112 0.0671086 2.0925943 0.2595008 0.0001054 -0.0596788 1.6753098 0.000101 0.0002507 -0.0000628 0.3421989 -0.0229841 0.0132669 0.0386167 -0.0677961 -0.0174956 -0.0886736 0.0046691 -0.1111002 -0.0698376 -0.023011 0.0132992 -0.0386445 -0.0677676 -0.017451 0.0886581 -0.0046856 0.1110628 -0.0698312 -0.0884212 -0.1021073 0.0000336 -0.1301546 -0.0113953 0.0000306 0.0000414 0.0000264 0.1147488 0.0952797 0.0062111 -0.0055498 0.0572139 0.0123898 -0.1120929 0.0261344 -0.1204586 -0.0682474 0.0952711 0.0062515 0.0055011 0.0572479 0.0124249 0.1120651 -0.0261989 0.120446 -0.0682768 0.200215 0.0066929 -0.0001064 0.0378401 0.1873442 -0.0000047 -0.0001231 -0.0000364 0.4143764 0.2129214 0.0350813 -0.0000762 -0.0061578 0.1753841 -0.000003 -0.0001336 -0.0000269 0.4078991 unknown
polarizability: 59.689688|2.5404263|48.5254696|0.001994|-0.0014429|31.4261586 unknown
InChI: InChI=1S/C3H7NO2/c1-2-6-3(4)5/h2,4H2,1H3
charge 0 multiplicity 1
13 atoms
O  -0.253289 0.512392 -0.000347
O  1.302195 -1.263179 0.00011
N  1.971055 0.990142 -0.000036
C  -1.355849 -0.485984 -0.000081
C  -2.662687 0.302775 0.000073
C  1.044766 -0.031876 -0.000424
H  -1.252926 -1.128963 -0.893781
H  -1.252636 -1.128839 0.893673
H  -3.519683 -0.396001 0.00026
H  -2.735921 0.94305 0.895897
H  -2.736213 0.942917 -0.895823
H  1.668367 1.960692 -0.000125
H  2.957719 0.748676 0.000402
