program: Gaussian 09
title: 000040468
version: EM64L-G09RevD.01
frameworkgroup: C1[X(C12H5Cl5)]
method: RPBEPBE
basis: SDD
operation: Freq
keyword: #pfreq=noraman
keyword: PBEPBE/SDD
title: #p freq=noraman PBEPBE/SDD
converged: NO NO NO NO
title: Mulliken charges:
elementType: Cl Cl Cl Cl Cl C C C C C C C C C C C C H H H H H
charge: 0.024693 -0.012991 0.012468 0.002895 -0.009055 0.508127 0.407164 -0.244981 -0.312091 -0.254459 -0.344152 -0.108911 -0.218548 -0.078591 -0.212161 -0.217644 -0.233781 0.254430 0.267035 0.241227 0.266826 0.262500
chargesum: 0.00000
title: Mulliken charges with hydrogens summed into heavy atoms:
elementType: Cl Cl Cl Cl Cl C C C C C C C C C C C C
charge: 0.024693 -0.012991 0.012468 0.002895 -0.009055 0.508127 0.407164 -0.244981 -0.312091 -0.254459 -0.089722 -0.108911 0.048487 -0.078591 0.029065 0.049182 0.028719
polarizability: 2.22322546e+02 -2.53028051e-02 1.56046490e+02 1.26727800e+01 -1.58447230e+00 1.38962337e+02
1716.lowfreq: -4.3542 -2.8363 -0.0003 0.0013 0.0023 5.8864 16.9135 43.7408 44.9763
frequency: 16.8634 43.7374 44.9763 87.3929 99.6692 101.8608 161.3347 193.0822 193.5916 205.5539 251.2879 269.6808 274.9621 296.4942 314.5811 361.1165 404.5065 438.5959 450.4101 461.4826 506.1379 523.5124 534.3792 587.5634 606.8506 657.1730 713.1728 726.3083 746.7828 760.0812 791.1142 809.3133 822.5572 906.3011 944.5472 975.7184 998.0279 1033.7559 1081.6644 1115.0429 1137.0189 1153.1189 1164.3109 1197.1416 1262.6457 1343.3443 1353.9256 1371.3936 1401.6967 1414.0836 1457.8489 1550.8770 1561.7727 1578.0004 1596.9108 3147.3272 3162.1262 3165.8537 3178.0910 3184.8460
redmass: 13.1815 16.2655 14.9837 16.1413 10.8345 10.3943 14.6308 29.9859 30.4800 4.6827 10.7767 9.9480 7.3950 7.7937 26.7297 8.4441 8.2027 6.0336 8.4423 10.2413 3.9637 7.9544 4.7394 5.6326 6.7367 8.4534 7.5002 2.9754 7.7882 7.5712 1.6673 1.3443 7.6588 1.3741 1.3413 1.3426 9.0718 6.2512 3.2546 2.9621 1.4753 1.5995 1.8988 1.3884 2.2802 10.7168 10.0607 3.6290 2.8815 2.3617 3.6348 7.4329 6.6444 8.9710 7.8179 1.0871 1.0929 1.0890 1.0998 1.0979
irintensity: 0.3192 0.4380 0.4779 0.3227 0.7697 0.8450 0.8605 0.0213 0.0341 0.4624 0.6882 1.6350 1.6440 0.0837 0.0686 2.5383 5.0964 0.3105 6.9343 8.9335 1.9856 23.9777 3.9783 2.3942 8.4857 20.4512 27.1483 22.0682 9.0742 61.4541 23.6883 41.3574 9.7173 0.9215 0.0073 0.1328 59.6811 24.4891 6.3328 4.2077 5.1086 13.4191 44.2589 5.2270 0.6369 6.9101 3.7070 50.6013 62.1509 92.6618 3.2020 11.0283 15.0079 1.5659 6.6877 2.7906 4.1245 0.1195 7.6983 0.4935
temp: 298.150 k
press: 1.00000 atm
elementType: 17 17 17 17 17 6 6 6 6 6 6 6 6 6 6 6 6 1 1 1 1 1
symmnumber: 1
zpe: 340298.8 jmol-1
zpe.correction: 0.129613 hartree
zpe.thermalcorrener: 0.145375 hartree
zpe.thermalcorrenthalpy: 0.146319 hartree
zpe.thermalcorrgfe: 0.083528 hartree
zpe.sumelectzpe: -2759.388887 hartree
zpe.sumelectthermal: -2759.373125 hartree
zpe.sumelectthermalent: -2759.372181 hartree
zpe.sumelectthermalfe: -2759.434971 hartree
dipole: -0.9481 1.7602 2.4410
dipole: 3.1553
quadrupole: -124.3081 -133.0732 -125.8143
quadrupole: -8.5204 9.7035 -1.5629
quadrupole: 3.4237 -5.3413 1.9176 -8.5204 9.7035 -1.5629
hfenergy: -2759.5184999 hartree
pointgroup: C01 [X(C12H5Cl5)]
dipole: 0.3403339 0.6076756 -1.0275832 debye
dipolederiv: -0.1545839 -0.2017202 -0.0331194 -0.1751362 -0.5745398 -0.0738248 -0.0399972 -0.0768065 -0.0203299 -0.3232455 0.3055249 -0.0115809 0.2755274 -0.5738541 0.0007796 -0.0234352 0.0006993 -0.0361122 -0.1590124 -0.0062124 -0.191879 -0.007443 -0.0157784 0.0086433 -0.1901668 0.0067431 -0.565803 -0.4348505 0.3280389 -0.0162728 0.4022779 -0.4220954 0.0115911 -0.0229852 0.0112958 -0.0252921 -0.4490594 -0.0699415 0.3080915 -0.0822322 -0.047132 0.0649421 0.3806432 0.0691957 -0.3835896 0.2448279 0.1051028 -0.0246029 0.0380901 -0.3371508 -0.0301626 -0.0005169 -0.016285 -0.0007511 0.2390481 0.0196274 -0.0361068 0.0406614 0.0172942 0.004836 -0.0766442 -0.0056753 -0.1165861 0.0399395 0.3392904 0.0471937 0.3806354 0.7444376 0.1250188 0.0448132 0.0964529 -0.0073792 0.3468144 -0.4971046 0.0288426 -0.3759946 0.8246617 0.0050381 0.0261926 0.0156534 -0.0498013 -0.0312216 -0.021281 0.3724457 -0.0240908 -0.0186333 0.00148 0.3878224 0.0135173 0.7224629 -0.1444206 0.0054649 -0.0379374 -0.0051049 -0.0950814 -0.0107712 0.0096435 -0.0087022 0.0258113 0.4878384 -0.5575132 0.0176899 -0.7236145 0.4416189 -0.0469295 0.0199525 -0.0317783 -0.0518015 -0.1340648 0.1415172 0.0071703 0.0772891 -0.1524783 0.015959 0.0100641 0.0166763 -0.0954159 0.550091 0.1070658 -0.5191469 0.1244777 -0.0137365 -0.0991246 -0.6988297 -0.1175018 0.4051584 0.0231231 0.01791 0.0410082 0.0182633 -0.1304159 -0.0087578 0.0296015 -0.009607 0.0761094 -0.0883634 0.0688545 0.0177876 0.1363898 -0.0552466 0.0173147 0.0127911 0.0122857 -0.0852014 -0.0906281 0.0014589 0.0615693 -0.0087752 -0.1020902 0.0108418 0.1616679 0.0235933 -0.1378991 0.0304789 -0.0210003 0.0812554 -0.0182386 0.1278654 0.0186574 0.0884141 0.0168483 0.0111885 0.0628715 -0.0212012 -0.0127728 -0.034107 -0.0083342 -0.0175763 -0.0191213 -0.0184331 0.15962 0.0363939 -0.0115523 -0.0504334 -0.0126841 0.1540732 0.0076899 -0.0596591 0.0074395 -0.0710517 -0.0185493 -0.0076283 -0.0253372 -0.0005447 0.0786658 -0.0070696 -0.0262466 -0.0082229 0.1589809 -0.0334272 -0.0247008 -0.0238645 -0.0256463 0.1579501 0.0014246 -0.014004 0.0026114 0.0876826 unknown
polarizability: 223.4268184|-5.9948487|156.6940782|4.657498|0.1012279|137.2104758 unknown
InChI: InChI=1S/C12H5Cl5/c13-7-4-5-9(15)12(17)10(7)6-2-1-3-8(14)11(6)16/h1-5H
charge 0 multiplicity 1
22 atoms
Cl 0.947403 -2.49761 -0.365992
Cl 0.204341 3.017771 -0.021785
Cl -1.023832 -0.135599 2.347589
Cl 4.136488 -2.054241 0.116605
Cl -4.205469 -0.537306 1.747698
C  0.723442 0.272839 -0.175844
C  -0.743571 0.081308 -0.421171
C  1.615366 -0.832858 -0.140766
C  1.285776 1.56056 0.008554
C  -1.651602 -0.112495 0.650026
C  -1.244227 0.097148 -1.745883
C  2.999745 -0.648738 0.072214
C  2.662695 1.761149 0.223654
C  -3.029524 -0.286914 0.393536
C  -2.620912 -0.077111 -1.998284
C  3.523829 0.646436 0.255051
C  -3.519971 -0.270179 -0.927915
H  -0.543354 0.246396 -2.573087
H  3.057475 2.770208 0.366349
H  -2.998565 -0.063512 -3.025211
H  4.596512 0.778686 0.421364
H  -4.590643 -0.407237 -1.105702
