program: Gaussian 09
title: 000040482
version: EM64L-G09RevD.01
frameworkgroup: C1[X(C12H2Cl8)]
method: RPBEPBE
basis: SDD
operation: Freq
keyword: #pfreq=noraman
keyword: PBEPBE/SDD
title: #p freq=noraman PBEPBE/SDD
converged: NO NO NO NO
title: Mulliken charges:
elementType: Cl Cl Cl Cl Cl Cl Cl Cl C C C C C C C C C C C C H H
charge: 0.038803 0.041560 0.041554 0.051397 0.016063 0.019804 0.019800 0.061870 0.446606 0.555714 -0.303029 -0.351476 -0.298196 -0.298209 -0.022935 -0.084010 -0.087074 -0.087070 -0.104714 -0.230467 0.282887 0.291120
chargesum: 0.00000
title: Mulliken charges with hydrogens summed into heavy atoms:
elementType: Cl Cl Cl Cl Cl Cl Cl Cl C C C C C C C C C C C C
charge: 0.038803 0.041560 0.041554 0.051397 0.016063 0.019804 0.019800 0.061870 0.446606 0.555714 -0.303029 -0.068588 -0.298196 -0.298209 -0.022935 -0.084010 -0.087074 -0.087070 -0.104714 0.060654
polarizability: 2.77330863e+02 -1.66641205e-03 1.86121043e+02 8.26574878e+00 -9.23082787e-04 1.68738783e+02
1716.lowfreq: -0.0005 0.0016 0.0024 4.0988 4.3047 6.9141 14.6323 33.4010 36.9870
frequency: 14.5872 33.4009 36.9862 66.2234 72.0832 78.2357 88.4571 130.5847 154.8848 181.9656 184.2563 195.4948 199.4477 206.6139 209.7726 248.9793 258.8740 297.3220 303.7781 318.1265 328.5750 331.9738 338.7136 359.5975 473.3928 477.3145 505.4042 519.7259 543.5215 588.5128 594.7330 595.0144 601.2913 669.7667 714.3247 744.9078 749.9604 790.8813 812.6737 867.4904 874.4116 882.1479 1012.8721 1058.3367 1143.9309 1157.7430 1168.5258 1236.9135 1311.8984 1338.6720 1340.2524 1363.2794 1376.5712 1424.1846 1532.3267 1545.3327 1559.1471 1580.5139 3173.5990 3182.1933
redmass: 27.4823 25.6640 21.1162 34.1654 31.3423 31.0425 24.0257 28.2891 10.4996 11.8017 32.3242 29.4280 31.5014 26.3053 33.8458 20.4151 6.2244 6.9672 26.6837 28.3541 30.6276 12.4458 29.9360 11.9877 15.1442 6.0371 6.4179 10.9574 6.0424 11.4434 12.0670 12.5846 5.2054 12.7435 10.4044 5.7137 8.0317 11.3821 12.1504 1.4313 11.3374 1.4862 10.9253 9.7956 8.7463 1.5367 1.8505 6.1374 10.7037 11.9604 9.8445 4.0502 3.3187 7.6183 10.3208 8.1075 10.7292 8.7715 1.0933 1.0934
irintensity: 0.0086 0.0001 0.0269 0.0008 0.0001 0.0173 0.0719 0.0877 0.1217 0.0400 0.0433 0.0998 0.0239 0.4540 0.0019 0.2370 1.6955 1.1290 0.0100 0.0815 0.0055 0.0386 0.0303 0.7261 32.8051 10.3203 2.3701 6.2701 0.8970 33.1712 0.7369 33.2515 2.2759 31.5113 17.1730 12.0356 3.4355 32.1445 1.3015 18.7825 32.5834 5.8809 49.5140 41.7332 11.3167 42.4462 36.2601 5.1481 87.3805 0.5083 9.4085 124.9106 151.4889 29.8043 20.1868 11.3066 6.6033 0.5935 0.3734 2.8813
temp: 298.150 k
press: 1.00000 atm
elementType: 17 17 17 17 17 17 17 17 6 6 6 6 6 6 6 6 6 6 6 6 1 1
symmnumber: 1
zpe: 264079.8 jmol-1
zpe.correction: 0.100583 hartree
zpe.thermalcorrener: 0.120314 hartree
zpe.thermalcorrenthalpy: 0.121258 hartree
zpe.thermalcorrgfe: 0.048584 hartree
zpe.sumelectzpe: -4137.536074 hartree
zpe.sumelectthermal: -4137.516342 hartree
zpe.sumelectthermalent: -4137.515398 hartree
zpe.sumelectthermalfe: -4137.588073 hartree
dipole: 1.8531 0.0001 -0.9240
dipole: 2.0707
quadrupole: -165.8523 -173.2826 -168.9008
quadrupole: 0.0002 -1.1424 -0.0004
quadrupole: 3.4930 -3.9374 0.4445 0.0002 -1.1424 -0.0004
hfenergy: -4137.6366564 hartree
pointgroup: C01[X(C12H2Cl8)]
dipole: -0.730892 -0.0005064 0.3598622 debye
dipolederiv: -0.2444705 0.0004456 -0.2556786 0.0005059 0.0013792 0.0008547 -0.284939 0.0008418 -0.4951284 -0.2281896 0.2734427 0.0025166 0.2421924 -0.5171835 -0.0011964 -0.0044643 -0.0026439 0.001552 -0.2282822 -0.2735005 0.0016237 -0.2422193 -0.5171013 -0.0005021 -0.005239 0.0009657 0.001555 -0.2286802 -0.0004343 0.2832567 -0.0005171 0.0099899 0.0007608 0.3256574 0.0007415 -0.468355 -0.2172834 0.0004319 -0.2508499 0.0005405 -0.0140098 0.0009965 -0.32223 0.0010173 -0.6159811 -0.3257173 0.3225197 0.0056642 0.3644058 -0.5250075 -0.0062346 0.0020178 -0.0030733 -0.0118211 -0.3258523 -0.3225711 0.0045874 -0.3644503 -0.5249009 0.0045175 0.000801 0.0013601 -0.0117985 -0.7332214 0.0001339 -0.0523974 0.0000816 0.0148272 0.0000302 -0.0263922 0.0000317 -0.003578 0.2303455 0.0001182 -0.0867021 0.000186 0.0125063 0.0001097 -0.1061709 0.0001034 -0.0431037 0.2786418 0.0000138 -0.0450042 0.0000315 -0.2306763 -0.0003846 -0.0572988 -0.0003726 0.0090738 0.1399642 -0.000816 0.4854515 -0.0008296 -0.0270881 -0.0010849 0.4775395 -0.0010659 0.591171 -0.2074937 0.0002105 -0.1164315 -0.0000069 -0.0510733 0.0002226 0.0142185 0.0002135 -0.1823474 0.102629 -0.4867131 0.0047197 -0.4871056 0.6053751 0.0051218 0.0026054 0.0177095 -0.0381625 0.1028231 0.4867939 0.0063102 0.487175 0.6052704 -0.003045 0.0041701 -0.0156649 -0.0382325 0.0692219 0.0008407 -0.5298609 0.0009612 -0.0034192 -0.0009143 -0.5928349 -0.0008922 0.5864398 0.0882771 -0.0007756 0.454787 -0.0007596 -0.0285073 -0.0015879 0.4460215 -0.001602 0.9233402 0.4041125 -0.5322186 -0.0054943 -0.66743 0.6758402 0.0064607 0.0027041 0.0072599 -0.043416 0.4043495 0.5322882 -0.0037221 0.6674649 0.6756509 -0.004032 0.0049165 -0.0048237 -0.0434522 0.9992773 -0.0001286 0.0521338 -0.0001392 -0.0410045 0.0003931 0.060414 0.0003868 -0.2808668 -0.1973062 -0.0000323 0.0079981 -0.0000097 -0.3360945 -0.0004951 0.0001536 -0.000491 -0.0427607 0.0728099 -0.0000514 0.0364689 -0.0000808 0.1335477 0.0001492 0.058409 0.000146 0.0401973 0.044045 0.0000026 0.0006234 0.0000034 0.0816791 -0.0001398 -0.0000594 -0.0001476 0.1656747 unknown
polarizability: 277.244743|-0.0231382|186.1209893|8.8128677|0.0306488|168.8249576 unknown
InChI: InChI=1S/C12H2Cl8/c13-4-1-3(8(16)12(20)11(4)19)7-9(17)5(14)2-6(15)10(7)18/h1-2H
charge 0 multiplicity 1
22 atoms
Cl 0.403077 0.004257 -2.662331
Cl -0.804388 -2.779471 0.090388
Cl -0.803863 2.779305 0.099513
Cl 3.629031 0.003759 -2.577696
Cl 3.416319 -0.005294 3.004276
Cl -4.063417 2.753283 0.109873
Cl -4.063948 -2.752865 0.100667
Cl 5.157973 -0.000866 0.258485
C  0.517114 -0.000265 0.116159
C  -0.981899 -0.000081 0.101241
C  1.271617 0.001553 -1.081226
C  1.199215 -0.002367 1.352602
C  -1.709194 -1.218801 0.101207
C  -1.708956 1.218768 0.105261
C  2.685835 0.001348 -1.046355
C  2.604218 -0.002592 1.393158
C  -3.121512 1.215447 0.105996
C  -3.121746 -1.2152 0.101933
C  3.361661 -0.000695 0.19963
C  -3.830377 0.000192 0.104398
H  0.631979 -0.00381 2.287028
H  -4.923139 0.000293 0.104795
