program: Gaussian 09
title: 000040467
version: EM64L-G09RevD.01
frameworkgroup: C1[X(C12H6Cl4)]
method: RPBEPBE
basis: SDD
operation: Freq
keyword: #pfreq=noraman
keyword: PBEPBE/SDD
title: #p freq=noraman PBEPBE/SDD
converged: NO YES NO NO
title: Mulliken charges:
elementType: Cl Cl Cl Cl C C C C C C C C C C C C H H H H H H
charge: 0.020505 -0.039074 0.036470 0.004023 0.430179 0.388998 -0.277827 -0.370416 -0.293324 -0.353464 -0.049013 -0.224299 -0.114331 -0.217562 -0.229576 -0.221996 0.260687 0.251118 0.264669 0.259439 0.236518 0.238275
chargesum: 0.00000
title: Mulliken charges with hydrogens summed into heavy atoms:
elementType: Cl Cl Cl Cl C C C C C C C C C C C C
charge: 0.020505 -0.039074 0.036470 0.004023 0.430179 0.388998 -0.277827 -0.109728 -0.293324 -0.102346 -0.049013 0.040370 -0.114331 0.041877 0.006941 0.016279
polarizability: 2.34406120e+02 -9.91391994e-01 1.43897389e+02 1.62363057e+01 6.53466158e+00 1.13636269e+02
1716.lowfreq: -2.3002 -0.0030 -0.0022 -0.0014 5.5547 9.4708 24.6187 43.1112 65.2892
frequency: 24.6009 43.0949 65.2863 81.2324 128.2362 143.9514 183.2215 205.5240 219.7925 239.5587 262.6448 291.9529 329.0793 373.5582 411.4588 428.6057 463.6972 471.2847 512.1848 519.5922 571.0958 597.2244 642.1684 691.1774 724.4888 734.4462 743.2674 764.4301 806.1588 819.2478 869.3204 947.9195 952.2125 988.1011 994.7194 1023.7158 1041.9865 1085.8054 1124.8435 1153.2910 1162.9374 1173.5180 1251.5685 1291.1748 1337.7468 1352.7297 1363.3510 1417.1500 1428.7864 1474.6011 1545.5871 1570.3491 1582.8874 1607.7241 3136.9342 3147.8223 3156.4280 3164.3349 3177.7074 3179.7934
redmass: 10.3935 11.1216 6.7719 22.7098 9.2437 5.9703 15.2304 29.0024 9.9802 7.7841 6.2571 8.1464 27.2641 7.7229 5.0774 6.2615 4.5346 7.8818 4.9614 7.7998 4.2661 5.3410 6.8706 7.4877 5.7386 6.9225 3.9930 1.3613 7.1902 1.3838 1.3786 1.3633 1.3678 1.3336 8.1757 5.2651 3.0645 3.0376 1.6459 1.4232 2.3041 1.0576 1.5272 2.1859 4.8935 7.1700 7.7357 2.2050 2.5501 3.3192 8.1414 6.1943 7.4748 7.4406 1.0861 1.0908 1.0893 1.0955 1.0997 1.0971
irintensity: 0.2380 0.1143 0.4340 0.0555 0.8185 0.3092 0.1353 0.0252 0.4361 1.6992 0.8308 1.1118 0.2594 3.7921 1.9065 4.4247 2.6761 14.0376 1.8612 12.2003 5.8648 7.0423 6.3562 19.7689 29.0650 4.5038 21.8337 81.6744 30.7316 31.4212 0.5072 0.3166 0.5060 0.1383 15.3103 28.7187 4.8249 11.8011 4.0486 3.8552 40.2508 0.5714 5.4782 2.3066 30.9830 21.5435 3.5555 33.2426 106.7060 11.2360 3.0942 8.9273 13.6040 0.7120 0.6247 10.7239 1.9887 12.9860 12.7044 1.2946
temp: 298.150 k
press: 1.00000 atm
elementType: 17 17 17 17 6 6 6 6 6 6 6 6 6 6 6 6 1 1 1 1 1 1
symmnumber: 1
zpe: 366041.2 jmol-1
zpe.correction: 0.139418 hartree
zpe.thermalcorrener: 0.153810 hartree
zpe.thermalcorrenthalpy: 0.154755 hartree
zpe.thermalcorrgfe: 0.095694 hartree
zpe.sumelectzpe: -2300.002479 hartree
zpe.sumelectthermal: -2299.988087 hartree
zpe.sumelectthermalent: -2299.987142 hartree
zpe.sumelectthermalfe: -2300.046203 hartree
dipole: -3.1225 -2.9520 -1.1276
dipole: 4.4424
quadrupole: -110.1688 -114.8816 -119.0665
quadrupole: 0.0574 4.2058 1.9979
quadrupole: 4.5368 -0.1760 -4.3609 0.0574 4.2058 1.9979
hfenergy: -2300.141897 hartree
pointgroup: C01[X(C12H6Cl4)]
dipole: -1.2463434 0.8554159 0.8773058 debye
dipolederiv: -0.1890254 -0.2105977 -0.0325154 -0.2490542 -0.5347594 -0.0882349 -0.0403498 -0.0867518 -0.0255864 -0.2368962 -0.0149995 0.2187829 -0.0141518 -0.0514425 0.0176491 0.1988428 0.019416 -0.6413196 -0.309882 0.2854361 0.0688428 0.3542339 -0.3728265 -0.090133 0.089554 -0.0918453 -0.0217702 -0.800091 -0.155722 -0.0115903 -0.1438758 -0.0921852 -0.0092572 0.0035275 -0.0102571 -0.0286974 0.3041469 -0.0352568 0.0371195 -0.1053081 -0.1642241 -0.0311154 0.01413 -0.0236835 -0.0166962 0.2614024 -0.0392702 0.0738032 -0.0121212 -0.0315809 0.006477 0.0696235 -0.0038124 -0.215523 0.0903726 0.3844194 0.0562938 0.433829 0.6961198 0.100323 0.0738661 0.1273935 0.0035625 -0.059176 0.0221744 -0.0029028 0.0494639 0.0651087 0.0331527 0.0288476 0.02208 -0.1144947 0.1890096 0.0356962 -0.4009204 0.0443442 -0.0377953 -0.0091815 -0.2345053 -0.0389261 0.9249597 -0.089945 0.0144567 0.0046895 -0.0237234 -0.1133651 -0.0108632 -0.0403455 0.0029049 0.064402 0.1271706 -0.5875474 -0.1264042 -0.6334917 0.3883675 0.1186874 -0.137228 0.11631 0.0091612 -0.308143 -0.04707 -0.0082505 0.03214 -0.0188192 0.0202299 -0.0156363 0.0155103 -0.0897496 1.0835945 0.3388031 0.0325171 0.2463968 0.0317817 0.0074287 -0.0004603 0.0056764 -0.0462024 -0.1489744 -0.0021507 0.1778754 -0.0045204 -0.0977662 0.0161065 0.1051525 0.0229811 -0.1743476 -0.0960906 0.0077869 -0.0832768 0.0277699 -0.1464189 -0.0008523 -0.066041 0.008171 0.0492073 0.1032276 0.0300982 0.0192634 0.0271788 -0.1421938 0.0094188 -0.0148513 0.0008642 0.0477517 0.0305742 0.0698394 0.0250822 0.0773665 0.0128425 -0.0233567 0.023439 -0.0311591 0.1312456 0.0519631 -0.0184076 -0.0840407 -0.0104005 0.1310791 -0.0144858 -0.0939852 -0.0040958 -0.0211567 0.0461189 -0.0435646 -0.0067702 -0.043554 0.0036478 -0.0357869 -0.0021242 -0.034314 0.1555852 0.0446674 -0.007857 -0.0499714 -0.0177165 0.1580786 -0.0096274 -0.0697142 -0.0107291 -0.0023887 0.0214022 -0.0051634 0.0738938 -0.009489 0.1588788 -0.0028085 0.0945136 -0.0043176 -0.065138 -0.1154264 -0.0211037 0.0184791 -0.0253164 0.1574727 -0.0037704 0.0137445 -0.0014156 0.0771955 unknown
polarizability: 235.2872154|6.5965556|132.5566819|-10.6750442|16.3465027|124.0958798 unknown
InChI: InChI=1S/C12H6Cl4/c13-9-4-2-1-3-7(9)8-5-6-10(14)12(16)11(8)15/h1-6H
charge 0 multiplicity 1
22 atoms
Cl 0.317079 -2.418005 -0.404584
Cl -1.350523 0.084106 -2.595014
Cl 3.513432 -2.015269 -0.479163
Cl 4.769197 0.923778 0.128334
C  0.159751 0.30734 0.169683
C  -1.329341 0.160663 0.214862
C  1.026489 -0.781199 -0.106047
C  0.744125 1.568126 0.447592
C  -2.132175 0.046192 -0.946352
C  -1.996411 0.170882 1.468893
C  2.433092 -0.618821 -0.126229
C  2.140765 1.750557 0.434778
C  2.978568 0.657487 0.144111
C  -3.533667 -0.074337 -0.885676
C  -3.400453 0.052858 1.554624
C  -4.16981 -0.07429 0.37633
H  0.087669 2.417199 0.660497
H  -1.393885 0.256548 2.379757
H  2.58181 2.72915 0.641037
H  -4.114041 -0.160732 -1.808519
H  -3.888786 0.054996 2.534427
H  -5.259287 -0.169629 0.431357
