program: Gaussian 09
title: 000005679
version: EM64L-G09RevD.01
frameworkgroup: C1[X(C14H18N2O2S)]
method: RPBEPBE
basis: SDD
operation: Freq
keyword: #p
keyword: freq=noraman
keyword: PBEPBE/SDD
title: #p freq=noraman PBEPBE/SDD
converged: YES YES NO NO
title: Mulliken charges:
elementType: S O O N N C C C C C C C C C C C C C C H H H H H H H H H H H H H H H H H H
charge: 0.972296 -0.535390 -0.528863 -0.511519 -0.545546 -0.369152 -0.373876 -0.244375 -0.339565 0.393278 0.406916 -0.402917 -0.269410 -0.402217 -0.432053 -0.240785 -0.415455 -0.246871 -0.235927 0.205803 0.193185 0.253115 0.222183 0.185792 0.228982 0.300533 0.202725 0.200238 0.304408 0.289472 0.246993 0.244049 0.244775 0.237457 0.236273 0.264139 0.261309
chargesum: 0.00000
title: Mulliken charges with hydrogens summed into heavy atoms:
elementType: S O O N N C C C C C C C C C C C C C C
charge: 0.972296 -0.535390 -0.528863 -0.210986 -0.020098 0.029836 0.101422 -0.244375 0.075210 0.393278 0.406916 0.000045 0.034998 -0.112745 -0.185060 0.003264 -0.170680 -0.009414 0.000346
polarizability: 2.42923388e+02 2.24158194e+01 2.11222008e+02 2.65562112e+01 -1.90134539e+01 1.52070695e+02
1716.lowfreq: -5.2643 -1.5797 0.0017 0.0018 0.0019 7.3940 13.8219 16.7009 28.8962
frequency: 10.7409 15.0503 28.7178 53.7123 58.7076 93.4243 116.6006 123.5066 149.9904 177.5077 178.9129 186.2490 227.5151 238.2823 244.2652 259.5204 261.3757 323.5089 342.7263 392.7790 411.5106 415.5931 430.0120 453.7476 471.0010 497.3473 510.1086 522.9433 543.6251 626.3058 631.7438 640.2267 721.6528 735.9536 752.6980 779.9017 782.8649 785.3145 806.2608 817.6574 821.6442 882.4637 889.9729 923.0711 930.7738 941.7444 949.0333 973.0082 995.1338 1001.8264 1004.7820 1015.9968 1029.1491 1062.7135 1067.6464 1079.0915 1097.8733 1127.2027 1142.2036 1159.9032 1177.2440 1194.6185 1205.3762 1236.3512 1250.2840 1274.7313 1280.6570 1287.6984 1326.7953 1333.2297 1345.5436 1351.4895 1364.5477 1367.5326 1396.4585 1413.1702 1433.1464 1447.1160 1458.7593 1459.7440 1476.4043 1479.8335 1505.3965 1570.8144 1596.9306 1633.5380 1645.4784 2937.0558 2964.1317 2968.4822 2978.6782 3010.9955 3021.8488 3047.1536 3056.3919 3127.5399 3132.2559 3134.8579 3147.7366 3149.4222 3166.7163 3167.9072 3410.2140 3445.2132 3569.4944
redmass: 4.3982 5.1819 4.4140 4.4552 1.7882 3.5481 3.1470 4.8906 5.7845 4.2041 3.2181 2.8785 3.3301 7.9951 6.5252 1.8439 1.7951 4.8761 3.6930 4.0929 2.9592 4.2355 4.9469 6.0672 3.4141 2.4332 7.2471 7.1164 3.7035 3.4353 1.4924 6.4922 1.8574 1.1005 1.3287 4.1692 2.3143 5.5960 1.3444 5.8726 1.5241 1.8579 1.6451 5.8006 2.1445 1.3783 3.9981 1.3892 1.3739 1.3578 2.0123 1.9909 2.4600 2.3643 2.4799 3.0199 3.3085 2.0756 1.6293 1.3046 1.1380 1.3836 1.2496 1.8632 1.3749 1.6187 1.2421 1.0986 1.2496 1.1932 1.2708 1.3514 1.7131 1.3206 4.3228 5.0290 2.5104 2.2687 1.0725 1.0843 1.0792 1.0944 3.4610 7.5997 5.5447 6.8264 1.0875 1.0652 1.0613 1.0614 1.0621 1.0963 1.1021 1.0960 1.1029 1.0869 1.0882 1.0896 1.0910 1.0950 1.1003 1.0989 1.0759 1.0447 1.0969
irintensity: 0.2054 0.9774 1.0119 1.9213 5.5444 0.9965 1.2058 2.5905 3.4782 3.2000 5.5557 1.6916 6.6243 2.7928 0.6367 30.0065 30.9041 19.2700 18.8156 4.9324 19.8822 2.9238 23.0598 169.3419 19.5411 51.3811 10.7458 2.3717 6.6817 5.3178 340.9146 4.2726 18.0806 8.1778 1.9450 2.1880 66.9511 2.3761 6.3827 86.5674 98.5063 23.0454 0.9857 4.3826 7.2646 0.3239 51.8300 3.3786 2.6344 0.1652 6.9282 24.5744 7.3550 0.6501 9.7277 7.0230 7.2494 4.5535 29.6748 0.9677 2.7075 5.3836 12.3272 6.3593 4.0984 13.6375 1.2694 3.7377 1.2239 0.0466 2.3033 16.9569 19.6498 4.5763 8.2365 0.1695 0.4711 6.9535 2.1424 0.8719 18.5172 13.7799 20.5913 1.3683 3.0009 2.4710 31.5328 33.1294 21.2754 2.4491 98.1548 20.4986 4.3034 8.5556 77.1038 0.3369 2.7385 11.3029 6.3930 8.4037 30.2425 21.8088 13.1172 1.5722 0.1282
temp: 298.150 k
press: 1.00000 atm
elementType: 16 8 8 7 7 6 6 6 6 6 6 6 6 6 6 6 6 6 6 1 1 1 1 1 1 1 1 1 1 1 1 1 1 1 1 1 1
symmnumber: 1
zpe: 776757.9 jmol-1
zpe.correction: 0.295851 hartree
zpe.thermalcorrener: 0.315490 hartree
zpe.thermalcorrenthalpy: 0.316435 hartree
zpe.thermalcorrgfe: 0.244559 hartree
zpe.sumelectzpe: -1200.703318 hartree
zpe.sumelectthermal: -1200.683679 hartree
zpe.sumelectthermalent: -1200.682735 hartree
zpe.sumelectthermalfe: -1200.754611 hartree
dipole: -4.1992 -1.0846 -5.4825
dipole: 6.9905
quadrupole: -120.4633 -113.5477 -131.4567
quadrupole: 6.9396 8.0186 -8.2972
quadrupole: 1.3592 8.2749 -9.6341 6.9396 8.0186 -8.2972
hfenergy: -1200.9991696 hartree
pointgroup: C01 [X(C14H18N2O2S1)]
dipole: -1.6581098 0.5005803 2.1363886 debye
polarizability: 242.8282827|-23.311768|210.3926602|-25.6422089|-20.6197274|152.995148 unknown
InChI: InChI=1S/C14H18N2O2S/c15-10-3-4-11-16-19(17,18)14-9-5-7-12-6-1-2-8-13(12)14/h1-2,5-9,16H,3-4,10-11,15H2
charge 0 multiplicity 1
37 atoms
S  0.430175 -0.681107 -1.400284
O  1.100659 -2.15996 -1.451347
O  0.163635 0.196711 -2.741492
N  1.592162 0.333467 -0.396658
N  7.006215 0.579183 0.028718
C  3.322816 0.41739 1.361624
C  2.001644 -0.246345 0.905323
C  -1.186691 -0.868822 -0.381175
C  4.520939 0.098837 0.441489
C  -2.104247 0.221154 -0.225904
C  -3.23918 -0.023916 0.652538
C  5.816758 0.841982 0.865171
C  -1.344147 -2.114567 0.213746
C  -1.982264 1.501265 -0.864822
C  -3.396051 -1.308057 1.272602
C  -2.479332 -2.33691 1.053526
C  -4.185408 1.030273 0.873199
C  -2.925918 2.502357 -0.621877
C  -4.030813 2.272411 0.25645
H  3.532156 0.067944 2.393715
H  3.180783 1.516473 1.428525
H  2.17105 -1.326188 0.738821
H  1.221024 -0.131539 1.688958
H  4.709934 -0.994908 0.448265
H  4.260004 0.366986 -0.600101
H  1.224513 1.299726 -0.363539
H  5.630527 1.934422 0.857944
H  6.071236 0.578707 1.911201
H  -0.605906 -2.901578 0.025883
H  -1.176786 1.665615 -1.588442
H  -4.261719 -1.471777 1.924988
H  -2.616114 -3.316092 1.522758
H  -5.038721 0.840863 1.534946
H  -2.828086 3.471444 -1.122805
H  -4.759973 3.070435 0.431589
H  6.904247 0.897822 -0.940993
H  7.328179 -0.394002 0.065163
