program: Gaussian 09
title: 000040506
version: EM64L-G09RevD.01
frameworkgroup: C1[X(C18H19NO)]
method: RPBEPBE
basis: SDD
operation: Freq
keyword: #p
keyword: freq=noraman
keyword: PBEPBE/SDD
title: #p freq=noraman PBEPBE/SDD
converged: YES YES NO NO
title: Mulliken charges:
elementType: O N C C C C C C C C C C C C C C C C C C H H H H H H H H H H H H H H H H H H H
charge: -0.299719 -0.095512 0.250398 0.207610 0.478124 -0.530621 -0.637145 0.399885 0.144898 0.398650 -0.716044 -0.470583 -0.376033 -0.442543 -0.421764 -0.622351 -0.617559 -0.244856 -0.244420 -0.532418 0.253445 0.200809 0.239479 0.247329 0.243402 0.247213 0.241630 0.240809 0.254252 0.180637 0.220602 0.223392 0.189950 0.230468 0.227341 0.227735 0.273432 0.223219 0.206859
chargesum: 0.00000
title: Mulliken charges with hydrogens summed into heavy atoms:
elementType: O N C C C C C C C C C C C C C C C C C C
charge: -0.299719 -0.095512 0.250398 0.207610 0.478124 -0.076367 -0.397666 0.399885 0.144898 0.398650 -0.468715 -0.227182 -0.128820 -0.200913 -0.180955 0.033141 0.026251 -0.017515 -0.016685 0.171092
polarizability: 3.50524604e+02 -3.11774656e+01 2.24909821e+02 -8.29830068e+00 -1.43777137e+01 1.08448283e+02
1716.lowfreq: -7.4727 -0.9263 -0.0011 -0.0007 -0.0006 7.3692 39.5738 46.6726 55.8553
frequency: 39.4683 46.3666 55.7580 66.5844 92.9038 112.1375 140.4787 179.2154 203.6069 208.2091 233.9799 253.8698 257.0637 279.5375 283.3987 293.3923 331.3140 362.5379 391.3162 397.9732 417.0917 442.8409 471.8792 475.4471 511.0556 540.4288 553.0032 575.7896 620.5139 645.5494 666.9689 719.4569 749.0893 753.8772 767.6171 787.4607 798.9507 818.2690 828.8380 858.8458 863.9548 900.2466 906.2828 930.0142 941.8444 964.8847 972.7737 988.6154 1000.0076 1013.2136 1017.0104 1033.6495 1062.1156 1086.3077 1121.3827 1130.4608 1133.1574 1152.6125 1166.3859 1171.9895 1176.6130 1192.4290 1198.2935 1228.7062 1246.9865 1262.1444 1279.0622 1290.8798 1306.1057 1356.3582 1367.3471 1399.6677 1412.6655 1416.7094 1418.8542 1432.0749 1438.6180 1441.2905 1453.1837 1456.6230 1459.6507 1467.2222 1473.1343 1476.0081 1483.0871 1486.5973 1488.8311 1552.4938 1562.1312 1583.3440 1622.2933 1636.7864 2848.1631 2858.8572 2883.4036 2946.0237 3018.3462 3027.9309 3038.2729 3044.2051 3077.6009 3092.7177 3109.3156 3115.2408 3117.6418 3122.6540 3126.5580 3140.4042 3141.7142 3159.6700 3160.8130
redmass: 3.0485 3.4649 3.7647 3.8276 3.0868 4.0188 4.1493 2.8066 1.7822 1.9027 1.2177 1.6664 2.4991 3.7784 2.8266 2.1551 5.5893 2.9387 2.7558 3.0129 3.8107 2.7559 2.4630 4.2329 4.7382 3.8494 3.9244 5.5163 6.5380 5.0693 3.5053 5.7743 4.7129 1.2989 4.2977 2.5312 4.4122 1.6531 2.7263 1.5857 3.0918 1.5370 4.7153 2.0296 4.1723 1.3852 1.4357 1.3494 2.7441 2.3572 2.1611 1.6107 2.7904 1.2659 1.2470 1.4118 1.6972 1.3365 1.3859 1.2986 1.8167 1.3578 2.6314 1.7050 2.2463 1.6313 2.6971 1.4748 3.1496 2.0066 1.4870 4.5604 2.1738 1.3790 1.4173 2.2671 3.0168 1.5406 1.1982 1.8640 1.0539 1.1226 1.0583 1.4221 1.3673 1.2202 1.0631 5.6946 8.3049 5.6581 6.7151 6.6285 1.0571 1.0582 1.0680 1.0314 1.0724 1.0731 1.0873 1.1049 1.1011 1.0999 1.1010 1.0910 1.0861 1.0886 1.0881 1.0913 1.0935 1.0969 1.1001
irintensity: 0.2260 2.1026 0.3727 1.8763 5.3189 1.7609 0.6485 1.3628 1.6194 3.8520 0.1642 0.9925 0.3842 2.0349 0.1096 3.3823 7.2916 12.3137 0.8421 1.9265 2.3360 1.5383 20.5787 6.9288 2.3617 2.1114 1.6773 7.7862 2.3873 1.1730 14.5559 3.2809 0.9859 68.2191 4.6783 2.9412 3.3873 7.6591 3.7845 0.4308 1.5604 64.8293 1.9952 3.1275 44.5701 4.8111 7.0070 0.2122 37.6169 3.2416 22.3431 20.3875 79.6797 4.2988 3.2202 6.6113 5.2349 1.1916 21.6771 7.7446 14.8850 7.6466 99.3077 15.2827 6.8158 16.1457 6.0778 3.2759 2.0314 1.3084 14.1690 11.4102 1.6114 10.5202 6.6079 5.4217 2.3754 4.2607 3.7255 43.5693 10.9538 2.6770 22.9742 18.0580 8.3132 15.3155 10.1142 5.9655 4.4904 17.4003 34.0393 2.3570 67.9747 122.3318 131.3211 95.0844 41.0326 43.6768 5.7643 17.7195 28.5485 35.6872 36.2365 6.4312 6.1336 0.4202 8.8984 0.5517 40.9044 26.3331 38.0485
temp: 298.150 k
press: 1.00000 atm
elementType: 8 7 6 6 6 6 6 6 6 6 6 6 6 6 6 6 6 6 6 6 1 1 1 1 1 1 1 1 1 1 1 1 1 1 1 1 1 1 1
symmnumber: 1
zpe: 842677.8 jmol-1
zpe.correction: 0.320959 hartree
zpe.thermalcorrener: 0.339024 hartree
zpe.thermalcorrenthalpy: 0.339968 hartree
zpe.thermalcorrgfe: 0.274965 hartree
zpe.sumelectzpe: -825.836922 hartree
zpe.sumelectthermal: -825.818857 hartree
zpe.sumelectthermalent: -825.817912 hartree
zpe.sumelectthermalfe: -825.882916 hartree
dipole: -0.1129 1.1047 1.3359
dipole: 1.7372
quadrupole: -106.9433 -105.1793 -124.1315
quadrupole: 4.0108 3.1143 -5.4029
quadrupole: 5.1414 6.9054 -12.0468 4.0108 3.1143 -5.4029
hfenergy: -826.1578807 hartree
pointgroup: C01 [X(C18H19N1O1)]
dipole: 0.0230145 0.3937328 0.5581661 debye
polarizability: 344.4318877|-31.1376036|226.5349957|-39.1264442|-1.7196606|112.9158248 unknown
InChI: InChI=1S/C18H19NO/c1-19(2)12-17-16-11-14-7-5-4-6-13(14)10-15(16)8-9-18(17)20-3/h4-11H,12H2,1-3H3
charge 0 multiplicity 1
39 atoms
O  3.583707 -1.250305 -1.219993
N  2.884717 1.785446 0.027304
C  0.045289 -0.28703 -0.382747
C  1.452509 -0.153895 -0.729153
C  -0.497407 -1.614802 -0.082978
C  2.097467 1.176471 -1.08958
C  -0.841702 0.819904 -0.316282
C  -2.209421 0.676281 0.026239
C  2.237974 -1.313885 -0.782863
C  -2.740468 -0.649125 0.322232
C  -1.864436 -1.758348 0.258198
C  0.37104 -2.761218 -0.146748
C  1.706613 -2.615904 -0.489933
C  -3.10156 1.80697 0.092125
C  -4.133144 -0.78213 0.667922
C  2.055593 2.17987 1.185108
C  3.714959 2.907087 -0.461719
C  -4.441418 1.642146 0.429668
C  -4.963883 0.332785 0.72105
C  4.578536 -1.081885 -0.134783
H  2.814877 0.988779 -1.908506
H  1.334092 1.894557 -1.477016
H  -0.471341 1.826975 -0.533458
H  -2.252649 -2.761298 0.477344
H  -0.045144 -3.75192 0.070211
H  2.378481 -3.476505 -0.571929
H  -2.704442 2.804758 -0.130579
H  -4.528176 -1.780984 0.889455
H  1.488471 1.310308 1.555852
H  1.324346 2.993688 0.944665
H  2.709747 2.540473 1.999302
H  4.338941 3.29392 0.363944
H  3.11344 3.761148 -0.865827
H  4.3858 2.552185 -1.264562
H  -5.109446 2.509315 0.475854
H  -6.021464 0.222378 0.984875
H  4.396368 -0.119512 0.380065
H  5.560839 -1.084156 -0.632761
H  4.521095 -1.925944 0.581506
