program: Gaussian 09
title: 000005723
version: EM64L-G09RevD.01
frameworkgroup: C1[X(C12H10F2N2O3)]
method: RPBEPBE
basis: SDD
operation: Freq
keyword: #p
keyword: freq=noraman
keyword: PBEPBE/SDD
title: #p freq=noraman PBEPBE/SDD
converged: NO YES NO NO
title: Mulliken charges:
elementType: F F O O O N N C C C C C C C C C C C C H H H H H H H H H H
charge: -0.165566 -0.198106 -0.273142 -0.253585 -0.262957 -0.015082 -0.408653 0.434374 -0.477522 0.215233 0.024908 0.201872 -0.393906 -0.361116 -0.197170 -0.284765 0.183199 -0.499238 0.159408 0.304679 0.221433 0.271081 0.229197 0.262593 0.352635 0.249155 0.226656 0.234998 0.219386
chargesum: 0.00000
title: Mulliken charges with hydrogens summed into heavy atoms:
elementType: F F O O O N N C C C C C C C C C C C C
charge: -0.165566 -0.198106 -0.273142 -0.253585 -0.262957 -0.015082 -0.056018 0.434374 -0.172843 0.215233 0.024908 0.201872 -0.172473 -0.090035 0.032027 -0.022172 0.183199 0.211571 0.378794
polarizability: 2.94683747e+02 -5.69679625e+00 1.58065248e+02 4.13781036e+00 5.60062073e+00 7.28047462e+01
1716.lowfreq: -9.7046 -3.4198 -1.7652 -0.0007 -0.0005 -0.0004 5.4039 29.3822 41.4290
frequency: -8.7285 29.3609 41.4212 48.5092 59.8630 80.4765 113.6171 137.6834 152.7190 197.4067 207.8936 246.6793 270.3054 306.7913 318.9892 364.0545 389.7814 404.9779 429.7294 453.5712 471.8039 505.2575 513.7342 533.6722 586.9715 596.8827 618.2206 634.1358 675.6824 718.3180 743.7537 764.7089 783.4822 800.3755 813.2771 834.4080 848.3724 914.0637 927.0168 939.4179 965.8767 975.4681 982.8442 1019.9800 1032.6320 1053.2610 1106.7369 1113.7925 1114.6221 1154.6293 1187.8293 1200.4298 1224.6538 1245.7374 1262.3531 1283.7951 1310.6973 1312.1225 1380.4130 1388.1518 1390.0246 1419.2689 1448.3758 1459.3974 1467.0352 1493.0750 1497.8402 1569.9248 1583.1887 1611.9879 1665.6260 2997.9711 3062.3608 3107.9137 3132.8718 3150.5705 3159.4060 3174.1747 3182.7184 3187.0315 3512.5250
redmass: 4.5635 7.2551 10.8129 2.6213 11.9026 8.4763 7.2705 1.9002 4.4085 8.6861 2.1025 8.8917 5.3722 6.4801 4.5076 4.0994 7.9753 7.6367 7.3755 4.7286 5.2704 5.7190 2.6559 8.8825 8.8170 5.2819 8.3159 3.9207 7.0972 4.1343 4.2581 6.9047 1.2863 7.2644 1.5334 1.7041 7.2383 8.3143 1.4960 1.3596 3.7408 8.6155 1.3160 6.0189 4.1457 2.8575 1.4943 2.1984 1.6388 1.4412 2.0065 3.8037 2.1843 1.9513 1.6438 1.2033 1.7509 1.5176 3.4744 2.7283 4.0035 1.9529 1.4051 1.0513 1.0514 3.2574 3.0528 6.4890 6.5257 6.6373 6.3985 1.0305 1.0886 1.1027 1.1056 1.0883 1.0895 1.0942 1.0919 1.0980 1.0788
irintensity: 0.5961 1.2145 2.1574 8.6414 2.7803 1.6180 1.5988 1.8007 5.1606 1.2111 3.4059 1.1278 4.8974 7.4343 2.9682 1.7268 9.0023 2.1064 16.3881 1.9812 4.6386 8.9427 15.1048 8.0820 10.0745 2.3011 3.1982 3.3655 6.6021 1.2719 3.0310 11.8906 107.2914 12.5766 20.9098 46.3252 10.8065 268.3079 24.4346 7.5167 78.4634 56.2675 0.0605 180.3308 304.3347 231.8108 37.8969 96.0721 44.7415 23.1048 27.3974 87.5621 170.3230 3.9163 100.5899 42.2660 102.6928 21.7850 47.4905 34.1562 24.4510 39.7763 9.3286 12.0181 32.3774 1.0266 184.3285 38.4850 107.6790 41.8200 412.8157 64.4798 27.6731 32.8493 19.3523 4.8791 3.0616 5.6184 2.7404 5.2644 54.9089
temp: 298.150 k
press: 1.00000 atm
elementType: 9 9 8 8 8 7 7 6 6 6 6 6 6 6 6 6 6 6 6 1 1 1 1 1 1 1 1 1 1
symmnumber: 1
zpe: 538718.5 jmol-1
zpe.correction: 0.205187 hartree
zpe.thermalcorrener: 0.221496 hartree
zpe.thermalcorrenthalpy: 0.222441 hartree
zpe.thermalcorrgfe: 0.159367 hartree
zpe.sumelectzpe: -996.721105 hartree
zpe.sumelectthermal: -996.704796 hartree
zpe.sumelectthermalent: -996.703851 hartree
zpe.sumelectthermalfe: -996.766925 hartree
dipole: -1.7094 -0.9380 0.1615
dipole: 1.9565
quadrupole: -151.2563 -96.2457 -109.1185
quadrupole: -8.0248 -3.3897 -3.5464
quadrupole: -32.3828 22.6278 9.7550 -8.0248 -3.3897 -3.5464
hfenergy: -996.926292 hartree
pointgroup: C01 [X(C12H10F2N2O3)]
dipole: 0.6788092 -0.3502674 -0.0950693 debye
polarizability: 293.8995498|9.4147475|158.166679|-9.3063096|-8.3964419|73.4875125 unknown
InChI: InChI=1S/C12H10F2N2O3/c1-18-10-6-7(2-4-9(10)19-12(13)14)8-3-5-11(17)16-15-8/h2-6,12,16H,1H3
charge 0 multiplicity 1
29 atoms
F  5.42999 -0.265172 -1.357481
F  4.538842 -1.932889 -0.0886
O  1.77583 2.505365 -0.553309
O  3.503003 0.15914 -0.267027
O  -6.372403 -0.103462 -0.041345
N  -2.896892 0.947136 -0.211441
N  -4.26129 0.897114 -0.189033
C  -0.751543 -0.157012 -0.105711
C  -0.111099 1.094226 -0.284915
C  1.294418 1.217424 -0.324735
C  -2.23765 -0.225371 -0.076151
C  2.075095 0.031482 -0.198172
C  0.053991 -1.316412 0.058116
C  1.458115 -1.217106 0.020708
C  -2.970029 -1.467402 0.086045
C  -4.349687 -1.48026 0.104309
C  -5.113939 -0.240595 -0.039319
C  3.091166 2.928831 -0.02154
C  4.201516 -0.834595 -0.961406
H  -0.71069 2.000363 -0.399519
H  -0.389792 -2.301065 0.226193
H  2.076635 -2.106612 0.177381
H  -2.423503 -2.408033 0.193337
H  -4.92317 -2.403232 0.224294
H  -4.723282 1.806208 -0.294413
H  3.91634 2.538547 -0.636813
H  3.219535 2.594605 1.023199
H  3.058864 4.027797 -0.068151
H  3.668827 -1.25062 -1.835298
