program: Gaussian 09
title: 000040379
version: EM64L-G09RevD.01
frameworkgroup: C1[X(C6H9NS)]
method: RPBEPBE
basis: SDD
operation: Freq
keyword: #pfreq=noraman
keyword: PBEPBE/SDD
title: #p freq=noraman PBEPBE/SDD
converged: YES YES NO NO
title: Mulliken charges:
elementType: S N C C C C C C H H H H H H H H H
charge: 0.210220 0.011118 -0.455071 -0.340741 -0.020203 -0.682947 -0.330121 -0.434569 0.218514 0.214923 0.218190 0.207948 0.211708 0.212296 0.224721 0.268463 0.265552
chargesum: 0.00000
title: Mulliken charges with hydrogens summed into heavy atoms:
elementType: S N C C C C C C
charge: 0.210220 0.011118 -0.021633 0.085397 -0.020203 -0.034223 -0.061658 -0.169017
polarizability: 1.10336710e+02 3.23127663e-01 8.64612268e+01 -7.33829730e+00 -1.09463624e+00 5.17931175e+01
1716.lowfreq: -11.6372 -3.5901 -0.0022 0.0030 0.0033 7.2806 48.0162 87.6767 109.2430
frequency: 47.8946 87.5694 109.2358 227.8975 275.3958 291.4701 331.3186 494.9510 572.8131 602.1709 615.3988 675.7191 740.9318 750.8688 801.4062 835.6521 868.5103 888.1076 1042.5656 1064.7953 1094.1513 1102.4114 1159.4719 1205.1092 1227.3552 1264.7983 1284.1443 1298.1048 1340.2015 1392.4355 1441.4531 1457.0169 1473.5591 1477.9160 1485.4953 1522.1046 2971.8933 2975.8494 2988.6792 3021.2632 3046.0287 3074.8095 3078.4703 3194.1727 3227.1243
redmass: 3.0326 1.9918 4.0022 1.1117 2.8838 3.0105 3.9242 5.0304 8.9238 4.4102 5.6381 5.3337 1.1247 1.1989 4.8930 1.4397 1.2859 1.8959 2.7752 1.8532 2.0787 2.4041 3.1993 1.2123 1.3445 1.3690 1.2576 1.3062 1.4693 1.2124 8.4043 1.0845 1.0575 1.0436 1.0761 6.5197 1.0588 1.0371 1.0612 1.0982 1.1023 1.1017 1.0991 1.0952 1.0966
irintensity: 0.1975 0.0767 0.0859 0.0216 1.1628 0.1812 1.7990 4.7134 6.6363 10.5830 5.0719 11.0041 5.9122 50.3866 38.6058 23.2910 0.5916 5.1030 0.6945 0.9943 4.3708 13.8560 9.0844 10.8601 4.0327 0.4232 0.7056 1.6087 1.2031 11.7275 54.5218 2.8160 3.2564 14.9217 16.2698 5.0879 8.5099 43.2583 36.6785 3.2361 6.5097 72.8138 43.5177 5.6094 0.0798
temp: 298.150 k
press: 1.00000 atm
elementType: 16 7 6 6 6 6 6 6 1 1 1 1 1 1 1 1 1
symmnumber: 1
zpe: 359649.4 jmol-1
zpe.correction: 0.136983 hartree
zpe.thermalcorrener: 0.145453 hartree
zpe.thermalcorrenthalpy: 0.146398 hartree
zpe.thermalcorrgfe: 0.102815 hartree
zpe.sumelectzpe: -686.218763 hartree
zpe.sumelectthermal: -686.210293 hartree
zpe.sumelectthermalent: -686.209348 hartree
zpe.sumelectthermalfe: -686.252931 hartree
dipole: -2.3166 -0.6195 0.3301
dipole: 2.4206
quadrupole: -56.7101 -55.4447 -57.6520
quadrupole: -6.2099 -0.1838 0.9505
quadrupole: -0.1078 1.1575 -1.0497 -6.2099 -0.1838 0.9505
hfenergy: -686.355746 hartree
pointgroup: C01 [X(C6H9N1S1)]
dipole: -0.9128677 -0.2598407 -0.0781911 debye
dipolederiv: -0.3117968 -0.2082439 -0.0518289 -0.1933398 -0.1966221 -0.2366276 -0.0139468 -0.2318331 -0.0947126 -0.2880598 -0.060039 -0.0450576 -0.2757818 -0.4659546 -0.1983129 -0.2012596 -0.2567893 -0.3392317 -0.0691224 0.0060188 -0.0195645 0.0293371 0.1439259 -0.0318725 -0.0598424 -0.0252922 0.0709391 0.0811726 -0.0095515 0.0202651 -0.050145 0.1490944 0.0117224 0.1280075 0.0051687 0.0769866 0.3102943 -0.0440961 -0.1645769 0.0222812 0.0741623 0.2383884 -0.2245547 0.2554061 0.0604567 -0.093562 -0.0016025 0.0033604 0.0160241 0.1011457 0.0122855 -0.0637866 0.0169188 0.0673053 -0.1225675 0.0004065 -0.0217655 -0.0605273 -0.0182126 0.1232032 -0.0557699 0.1018581 -0.0111667 0.3187639 0.3182652 0.1186779 0.501427 0.2889034 0.2998242 0.2948689 0.3588226 0.0506494 0.0009887 -0.0447164 0.031168 -0.0559573 -0.097243 0.1005327 0.0219327 0.04875 0.0517887 0.0012203 0.0207343 0.0323957 0.0407693 0.0078735 -0.1223249 0.0380404 -0.084807 -0.052422 0.0274303 -0.0611044 0.0115749 -0.0348381 -0.1207715 0.0997375 0.0005583 0.0655292 0.032768 0.017368 0.0599913 0.0570407 0.0578978 -0.0084937 -0.1198023 0.0439929 -0.0797734 -0.059403 0.0579087 -0.0158713 0.0164079 -0.0797096 -0.1432334 0.0845513 0.0508324 0.0817499 0.0614327 0.0523103 0.0073854 0.0253733 0.0494563 -0.0151915 -0.1280764 0.0966927 -0.1245891 -0.0554468 -0.0840802 0.0267071 -0.1079453 0.0292262 0.0927365 0.0404549 -0.1489727 0.0408416 -0.0629581 0.0975023 0.0036041 0.0369041 0.0412971 0.0828116 -0.1166493 0.0701181 -0.1045767 0.0779163 0.0042294 0.0021123 0.0575707 -0.0374172 0.125069 -0.0570341 0.023089 -0.0673841 0.125098 unknown
polarizability: 110.3082514|5.4619944|69.6884974|-5.1007532|17.3391028|68.5943058 unknown
InChI: InChI=1S/C6H9NS/c1-2-3-6-4-7-5-8-6/h4-5H,2-3H2,1H3
charge 0 multiplicity 1
17 atoms
S  1.010597 -1.082164 -0.922539
N  2.419463 0.775737 0.371272
C  -1.287132 -0.175477 0.605469
C  -2.216252 0.114911 -0.606731
C  0.180377 -0.032738 0.305144
C  -3.707729 -0.024692 -0.237592
C  1.101277 0.852746 0.848174
C  2.549598 -0.166229 -0.542136
H  -1.505894 -1.194509 0.983889
H  -1.535755 0.523838 1.427791
H  -2.009755 1.134936 -0.983219
H  -1.966551 -0.581193 -1.431364
H  -3.9384 -1.048816 0.111634
H  -3.98685 0.677424 0.570471
H  -4.354966 0.188685 -1.107214
H  0.86257 1.594116 1.612209
H  3.473702 -0.417076 -1.061459
