program: Gaussian 09
title: 000005680
version: EM64L-G09RevD.01
frameworkgroup: C1[X(C14H17ClN2O2S)]
method: RPBEPBE
basis: SDD
operation: Freq
keyword: #p
keyword: freq=noraman
keyword: PBEPBE/SDD
title: #p freq=noraman PBEPBE/SDD
converged: YES YES NO NO
title: Mulliken charges:
elementType: Cl S O O N N C C C C C C C C C C C C C C H H H H H H H H H H H H H H H H H
charge: -0.041072 0.978881 -0.532426 -0.524326 -0.513023 -0.571990 -0.377383 -0.371900 -0.261133 -0.329366 0.437424 0.483618 -0.369919 -0.270312 -0.432239 -0.404848 -0.232067 -0.319137 -0.241932 -0.245797 0.204052 0.194245 0.255022 0.221165 0.180617 0.254660 0.302538 0.201604 0.168539 0.306303 0.294512 0.267925 0.246802 0.242913 0.263548 0.262080 0.272424
chargesum: 0.00000
title: Mulliken charges with hydrogens summed into heavy atoms:
elementType: Cl S O O N N C C C C C C C C C C C C C C
charge: -0.041072 0.978881 -0.532426 -0.524326 -0.210485 -0.037486 0.020914 0.104287 -0.261133 0.105910 0.437424 0.483618 0.000223 0.035991 -0.137727 -0.136923 0.014734 -0.319137 0.000981 0.017751
polarizability: 2.74767599e+02 2.51773842e+01 1.93937227e+02 2.15381780e+01 -3.35372211e+01 1.73848026e+02
1716.lowfreq: -9.0712 -4.4264 -0.0017 -0.0017 -0.0005 8.0189 11.3226 16.7278 27.9510
frequency: 10.4987 16.0469 27.8402 47.4421 62.9682 69.3661 112.0241 120.5380 140.0712 153.4588 179.7657 184.2498 187.8259 204.2247 233.5822 238.2663 244.7762 262.0680 264.8737 326.6721 341.9459 373.2830 399.1423 428.5864 440.9362 465.6696 468.5229 480.9800 499.4091 511.5827 540.6244 568.0224 578.5415 629.8599 687.1292 716.8166 744.6783 757.7569 780.8419 805.6934 809.3840 817.6967 831.6817 834.8593 880.2346 916.1435 937.4448 944.0033 946.3543 954.8161 987.4784 989.5914 998.4084 1040.5624 1056.9030 1079.9060 1081.9606 1092.1633 1115.7461 1136.2158 1143.1764 1170.7175 1193.8701 1204.5136 1208.3839 1222.8927 1250.0258 1278.9863 1282.7403 1301.0122 1330.1751 1350.9233 1354.7228 1368.5853 1374.9240 1389.6480 1404.5298 1415.4163 1444.2205 1462.1772 1475.3410 1479.5514 1494.6340 1494.7423 1560.5427 1593.2106 1628.1381 1638.3264 2847.0925 2933.9550 2963.7181 2971.0866 3002.2419 3014.3979 3051.3176 3073.9713 3139.2588 3145.5527 3157.2547 3158.6169 3175.7365 3177.9933 3417.6400 3458.8729 3587.6279
redmass: 6.4172 4.8322 4.4078 6.1221 1.7362 5.8365 2.8464 4.5173 7.3851 4.5050 4.0571 4.1426 4.1766 3.3044 2.2773 3.7170 2.0235 4.7238 5.9308 5.1040 3.4378 10.3133 4.9125 3.4329 11.0122 3.3466 4.5464 4.0512 2.8556 7.3718 7.9740 3.6130 1.2739 4.3888 7.9606 1.9803 1.6619 1.1288 5.6264 1.5527 4.9143 4.4225 2.3465 1.3572 1.8343 1.4132 5.0462 3.8006 1.4163 3.1223 1.4833 1.7536 1.3537 2.1822 2.5534 1.9345 2.8308 2.3775 2.4561 2.3940 1.4795 1.1933 1.4581 1.5596 1.2265 1.4643 1.8683 1.1219 1.1221 1.3146 1.2285 1.3625 1.8841 1.3355 3.1416 1.4781 3.8365 3.7029 2.3775 1.0778 1.0816 1.0787 3.7336 1.0994 8.1049 5.9739 7.2975 1.0946 1.0718 1.0658 1.0630 1.0673 1.0854 1.0977 1.0945 1.0969 1.0893 1.0880 1.0911 1.0935 1.0988 1.0976 1.0761 1.0447 1.0979
irintensity: 0.1980 0.3138 1.4753 3.4360 3.1030 0.0772 4.4740 3.0667 3.9019 0.7819 2.9357 4.9521 1.3523 1.4881 14.2915 9.2895 37.0885 4.0378 10.0382 14.3921 25.5486 16.6449 35.9886 22.6556 131.0934 0.8016 4.2474 69.2901 4.5267 7.3870 18.0382 1.6509 225.7726 9.4598 11.2667 21.2095 0.1665 8.0629 1.4765 57.3494 43.1911 147.9514 1.3561 3.2940 11.5429 1.6103 38.5690 24.1310 2.1039 56.1025 1.9109 9.6360 1.8350 6.0097 4.3011 2.4543 8.4097 1.3681 8.0414 27.9593 38.9686 1.7223 5.5713 6.3565 2.8458 6.3289 16.9175 5.2614 9.4098 0.9737 0.4110 12.1996 43.8868 4.4743 3.1396 26.0053 5.0226 10.3314 12.2111 2.4502 5.4721 22.5577 26.5302 4.7666 13.2106 8.1688 5.9730 43.4031 125.6760 31.8846 21.9367 36.0269 49.6429 30.2306 10.9799 37.1175 5.8587 6.1084 4.4993 5.5557 10.7864 4.9639 14.6064 1.3702 0.3202
temp: 298.150 k
press: 1.00000 atm
elementType: 17 16 8 8 7 7 6 6 6 6 6 6 6 6 6 6 6 6 6 6 1 1 1 1 1 1 1 1 1 1 1 1 1 1 1 1 1
symmnumber: 1
zpe: 750959.3 jmol-1
zpe.correction: 0.286025 hartree
zpe.thermalcorrener: 0.307018 hartree
zpe.thermalcorrenthalpy: 0.307962 hartree
zpe.thermalcorrgfe: 0.232820 hartree
zpe.sumelectzpe: -1660.090107 hartree
zpe.sumelectthermal: -1660.069115 hartree
zpe.sumelectthermalent: -1660.068171 hartree
zpe.sumelectthermalfe: -1660.143312 hartree
dipole: -1.1224 -3.3800 -5.0159
dipole: 6.1517
quadrupole: -126.2484 -129.9893 -139.8756
quadrupole: -6.0983 -15.6744 -13.2613
quadrupole: 5.7894 2.0485 -7.8379 -6.0983 -15.6744 -13.2613
hfenergy: -1660.3761326 hartree
pointgroup: C01 [X(C14H17Cl1N2O2S1)]
dipole: 0.3514953 -0.854539 2.2369427 debye
polarizability: 272.0163573|-21.8396209|208.6639317|30.8542975|24.3199552|161.8725623 unknown
InChI: InChI=1S/C14H17ClN2O2S/c15-13-7-3-6-12-11(13)5-4-8-14(12)20(18,19)17-10-2-1-9-16/h3-8,17H,1-2,9-10,16H2
charge 0 multiplicity 1
37 atoms
Cl 5.428917 -0.828234 1.498196
S  -0.806301 0.877852 -1.356174
O  -1.489979 2.344466 -1.220004
O  -0.59053 0.147711 -2.791342
N  -1.897655 -0.248047 -0.407065
N  -7.18491 -0.78334 0.210717
C  -3.526021 -0.579834 1.419635
C  -2.271976 0.19761 0.955712
C  0.865129 0.995427 -0.408322
C  -4.776943 -0.30344 0.559988
C  1.800578 -0.090398 -0.406454
C  2.985655 0.09292 0.426494
C  -6.017727 -1.065209 1.06808
C  1.04491 2.185032 0.284981
C  1.638029 -1.303207 -1.156376
C  3.166748 1.318539 1.147007
C  2.226234 2.346002 1.07168
C  3.926418 -0.989158 0.469351
C  2.593883 -2.316162 -1.069124
C  3.750725 -2.170254 -0.244095
H  -3.7171 -0.293893 2.474744
H  -3.306955 -1.668077 1.426576
H  -2.510011 1.27492 0.888215
H  -1.447379 0.066297 1.69073
H  -4.986702 0.787371 0.566085
H  -4.586214 -0.580639 -0.491214
H  -1.526178 -1.209346 -0.487945
H  -5.815606 -2.153907 1.022979
H  -6.17511 -0.813783 2.148598
H  0.290223 2.975431 0.211901
H  0.791794 -1.400314 -1.843933
H  4.06602 1.436895 1.758422
H  2.383994 3.280835 1.618175
H  2.471892 -3.235455 -1.650729
H  4.494124 -2.969709 -0.183675
H  -7.410828 0.213019 0.129496
H  -8.012947 -1.352124 0.409291
