program: Gaussian 09
title: 000040441
version: EM64L-G09RevD.01
frameworkgroup: C1[X(C20H29N)]
method: RPBEPBE
basis: SDD
operation: Freq
keyword: #pfreq=noraman
keyword: PBEPBE/SDD
title: #p freq=noraman PBEPBE/SDD
converged: NO YES NO NO
title: Mulliken charges:
elementType: N C C C C C C C C C C C C C C C C C C C C H H H H H H H H H H H H H H H H H H H H H H H H H H H H H
charge: -0.072424 0.407972 -0.166368 -0.264441 -0.080878 -0.088074 -0.568563 -0.532205 -0.485436 -0.465151 -0.479244 -0.497083 0.478037 -0.412161 -0.464818 -0.380520 -0.237736 -0.264084 -0.621210 -0.619959 -0.249052 0.217933 0.193776 0.193096 0.193858 0.205814 0.205543 0.201995 0.198822 0.198564 0.202108 0.196721 0.217726 0.197696 0.197888 0.205102 0.222137 0.202930 0.223676 0.228287 0.224450 0.223062 0.222286 0.233033 0.189199 0.214035 0.219987 0.182516 0.224223 0.226936
chargesum: 0.00000
title: Mulliken charges with hydrogens summed into heavy atoms:
elementType: N C C C C C C C C C C C C C C C C C C C C
charge: -0.072424 0.407972 0.051565 -0.070665 0.112218 0.105784 -0.157206 -0.131388 -0.084764 -0.050704 -0.083660 -0.069844 0.478037 0.014445 -0.236531 -0.156070 -0.014674 -0.041798 0.015057 0.006766 -0.022116
polarizability: 2.27735123e+02 -2.41623228e+01 2.11811561e+02 -7.62893411e+00 -9.56496618e+00 1.82035971e+02
1716.lowfreq: -26.7824 -16.6815 -14.8419 -0.0003 -0.0001 0.0003 12.4407 33.1802 37.7854
frequency: -24.8341 33.1429 37.4205 68.7538 87.2663 105.1884 114.5340 195.8753 203.0182 215.2190 226.0670 246.6283 260.3476 268.0106 279.9778 332.4370 348.3646 364.8989 376.5722 401.7590 406.9396 423.6057 434.8121 445.3969 452.5555 476.0783 536.7554 596.4264 608.5900 617.2560 635.4233 660.2393 708.0128 736.4964 754.9628 765.1153 782.3678 802.4582 810.1511 829.0985 835.2579 851.5906 867.9720 871.9478 911.7999 916.5632 925.7202 938.5883 944.1095 965.5720 974.2308 989.3524 991.7747 992.9084 1013.2865 1015.6701 1030.6995 1031.7473 1044.0929 1051.3628 1065.8606 1066.7502 1076.8205 1089.5896 1092.7664 1099.1103 1109.1752 1112.2897 1130.3306 1131.5553 1150.7272 1157.3960 1170.6379 1188.3233 1194.9801 1202.4568 1215.6919 1225.7872 1241.0654 1257.5180 1273.1579 1279.1443 1285.8129 1295.4700 1298.7027 1307.2086 1315.6087 1318.3383 1320.5471 1325.6152 1341.6380 1342.1127 1343.4270 1357.0351 1358.5952 1364.0841 1384.2692 1391.5214 1418.5985 1439.5585 1440.4752 1452.4380 1455.8147 1457.6908 1460.1684 1464.6806 1467.6483 1474.0661 1475.3529 1478.8457 1479.9763 1485.9569 1491.5630 1586.4230 1609.7183 2837.1812 2843.3712 2860.5772 2956.3211 2957.8575 2959.6033 2960.5304 2967.1710 2972.9789 2976.7030 2990.8982 2992.2997 3003.8251 3010.1775 3014.2021 3015.2656 3020.8216 3022.3712 3029.5210 3031.6661 3035.5164 3040.2550 3073.7579 3089.9553 3106.5997 3122.0712 3134.9647 3155.1722 3173.2603
redmass: 2.5237 3.7502 3.6387 3.1586 3.3899 3.5394 2.2779 2.7273 1.6814 2.3100 1.8553 1.6407 3.3114 2.6099 2.5554 2.3742 2.2182 1.9112 2.4336 3.8750 2.8490 2.2349 2.2481 2.6556 2.0359 2.7838 3.0200 3.3995 6.3135 6.1836 3.9127 4.2442 1.6592 2.9928 2.3527 1.6061 2.8673 2.3631 3.3212 3.1108 2.8471 1.2629 1.6211 1.5819 2.6189 1.5643 2.1550 2.3325 2.3003 2.1986 1.3981 3.5877 1.6499 2.2938 1.9458 2.5085 1.7194 1.9078 1.8751 1.7738 2.3967 1.7482 1.5917 1.3996 1.4769 1.5056 1.3392 1.0323 1.9406 1.4657 1.7425 1.3132 1.0624 1.3769 1.1480 1.9052 2.0199 1.5088 1.3497 2.4661 1.7080 1.7859 1.6155 1.6097 1.8861 1.8723 1.5113 1.2912 1.4030 1.3090 1.4026 1.4346 1.4859 1.8213 1.5602 1.5584 1.4339 2.3061 1.1459 1.4997 1.4210 1.0831 1.0843 1.0971 1.0537 1.0648 1.1140 1.1402 1.0542 1.0818 1.6510 1.0713 1.1940 5.6392 6.1717 1.0596 1.0644 1.0606 1.0638 1.0778 1.0641 1.0609 1.0660 1.0651 1.0595 1.0829 1.0836 1.0839 1.0947 1.0712 1.0974 1.1003 1.1001 1.0732 1.0968 1.0987 1.0986 1.1009 1.0991 1.0872 1.0863 1.0931 1.0980 1.0946
irintensity: 0.5121 0.1377 0.0614 0.3771 0.1297 0.1475 0.0814 0.2411 0.7998 0.5058 0.2275 0.7577 0.1503 1.1531 0.2913 7.0195 2.2111 0.3987 0.6906 0.6078 0.1020 1.0300 0.2315 1.2440 0.0979 0.2625 13.4105 2.2922 1.4706 0.1646 1.6533 1.2562 55.2936 5.5478 32.3670 1.9396 6.5656 3.5025 6.0031 9.3092 1.7100 0.3062 0.2686 0.1744 0.2692 1.1628 0.6987 1.1413 1.7887 8.3715 0.5977 1.6270 0.8369 1.8145 0.5049 27.2304 11.2942 13.3950 3.2721 1.1391 13.6804 1.7589 1.5489 11.8650 0.9353 6.7251 12.8419 0.1716 3.2366 6.2743 4.4428 2.5435 0.0906 2.4595 0.7591 2.5782 0.7066 7.8180 3.6619 5.8451 0.5639 0.3576 1.8825 1.9772 0.5244 4.2690 4.7993 0.3911 6.3497 0.5336 0.5918 2.7331 0.4829 0.6711 0.6015 0.6783 3.9859 0.3396 1.7995 5.5602 3.8549 5.9816 0.9685 6.2464 19.4075 11.0253 11.0491 10.1701 20.9630 14.0768 29.7927 19.1275 9.1753 2.1123 9.6177 91.3539 42.8884 185.9457 12.7615 35.6714 23.5052 30.0657 24.8582 16.5090 41.7299 129.8918 140.4391 79.0514 2.6879 48.9221 4.5107 58.9146 77.1633 48.0564 10.7876 40.4988 109.6281 38.9872 41.6769 11.4211 0.1691 30.3200 43.1750 10.5976
temp: 298.150 k
press: 1.00000 atm
elementType: 7 6 6 6 6 6 6 6 6 6 6 6 6 6 6 6 6 6 6 6 6 1 1 1 1 1 1 1 1 1 1 1 1 1 1 1 1 1 1 1 1 1 1 1 1 1 1 1 1 1
symmnumber: 1
zpe: 1167480.3 jmol-1
zpe.correction: 0.444670 hartree
zpe.thermalcorrener: 0.462865 hartree
zpe.thermalcorrenthalpy: 0.463809 hartree
zpe.thermalcorrgfe: 0.399138 hartree
zpe.sumelectzpe: -832.662165 hartree
zpe.sumelectthermal: -832.643970 hartree
zpe.sumelectthermalent: -832.643026 hartree
zpe.sumelectthermalfe: -832.707697 hartree
dipole: 0.2736 0.2672 0.6756
dipole: 0.7763
quadrupole: -124.8209 -130.4577 -125.9235
quadrupole: -3.9742 -3.3648 -4.9370
quadrupole: 2.2465 -3.3903 1.1439 -3.9742 -3.3648 -4.9370
hfenergy: -833.1068343 hartree
pointgroup: C01 [X(C20H29N1)]
dipole: 0.0861088 0.1334277 0.2609069 debye
polarizability: 235.8517608|-19.9205213|202.8238173|-4.8341407|-11.6744931|182.9070771 unknown
InChI: InChI=1S/C20H29N/c1-21(2)9-8-20-13-15-10-16(14-20)12-18(11-15)19(20)17-6-4-3-5-7-17/h3-7,15-16,18-19H,8-14H2,1-2H3
charge 0 multiplicity 1
50 atoms
N  -2.51688 -2.904809 -0.222575
C  0.811394 -0.805031 -0.357076
C  1.843453 1.147018 0.94837
C  0.501442 0.397535 0.620744
C  3.096603 -1.053511 0.801471
C  2.893493 0.41811 -1.244812
C  1.772647 -1.767902 0.414724
C  1.589524 -0.330085 -1.625684
C  2.779107 0.165919 1.70738
C  2.561422 1.633765 -0.337829
C  3.823175 -0.560036 -0.478125
C  -0.479147 -1.542902 -0.817312
C  -0.644581 1.35126 0.264508
C  -1.347699 -2.152161 0.303772
C  -1.632432 1.600159 1.258676
C  -0.778551 2.049567 -0.968128
C  -2.699009 2.500164 1.044812
C  -1.846981 2.94738 -1.192215
C  -3.5387 -2.032196 -0.839029
C  -3.113355 -3.772982 0.814133
C  -2.813985 3.180104 -0.188982
H  1.611476 2.015786 1.595827
H  0.194327 -0.073669 1.578717
H  3.747671 -1.763906 1.34926
H  3.399895 0.768431 -2.166444
H  1.989255 -2.648309 -0.225231
H  1.282511 -2.148095 1.333002
H  0.946836 0.300995 -2.267166
H  1.842478 -1.224536 -2.232145
H  2.296453 -0.171013 2.647219
H  3.718232 0.68315 1.989327
H  3.497153 2.158348 -0.057629
H  1.936442 2.367811 -0.880263
H  4.771033 -0.053839 -0.205084
H  4.086047 -1.421063 -1.12539
H  -0.195813 -2.366626 -1.503379
H  -1.085522 -0.829915 -1.408914
H  -1.677698 -1.35008 1.013451
H  -0.739408 -2.86997 0.885705
H  -1.555445 1.078785 2.221785
H  -0.051498 1.901891 -1.770306
H  -3.438627 2.667693 1.83637
H  -1.92144 3.467712 -2.154371
H  -3.109355 -1.472244 -1.685922
H  -3.970414 -1.289692 -0.119024
H  -4.364099 -2.654112 -1.229936
H  -3.933373 -4.368787 0.373817
H  -3.531917 -3.204646 1.685433
H  -2.350312 -4.473398 1.198828
H  -3.640329 3.878032 -0.364557
