program: Gaussian 09
title: 000005735
version: EM64L-G09RevD.01
frameworkgroup: C1[X(C17H17ClN6O3)]
method: RPBEPBE
basis: SDD
operation: Freq
keyword: #p
keyword: freq=noraman
keyword: PBEPBE/SDD
title: #p freq=noraman PBEPBE/SDD
converged: YES YES NO NO
title: Mulliken charges:
elementType: Cl O O O N N N N N N C C C C C C C C C C C C C C C C C H H H H H H H H H H H H H H H H H
charge: -0.046462 -0.286742 -0.318174 -0.150131 -0.143645 -0.068965 -0.259645 0.037973 0.070344 0.004201 -0.379378 -0.377803 -0.361433 -0.362811 -0.117700 0.362014 -0.613133 0.064335 -0.149158 0.156366 0.219784 -0.260686 -0.266221 -0.263422 -0.137170 -0.368859 -0.054021 0.256839 0.228295 0.231645 0.252112 0.221464 0.195812 0.197894 0.221101 0.286199 0.226746 0.226594 0.192690 0.288894 0.251635 0.254174 0.267788 0.270662
chargesum: 0.00000
title: Mulliken charges with hydrogens summed into heavy atoms:
elementType: Cl O O O N N N N N N C C C C C C C C C C C C C C C C C
charge: -0.046462 -0.286742 -0.318174 -0.150131 -0.143645 -0.068965 -0.259645 0.037973 0.070344 0.004201 0.105755 0.105954 0.055843 0.056184 0.168499 0.362014 0.032898 0.064335 -0.149158 0.156366 0.219784 0.028208 -0.014586 -0.009247 0.130617 -0.098197 -0.054021
polarizability: 2.80980891e+02 4.33439733e+01 3.17114197e+02 2.26740292e+01 -1.75183599e+01 1.68998915e+02
1716.lowfreq: -5.7161 -1.1053 -0.0018 -0.0006 0.0005 6.0415 8.8676 27.4572 32.7417
frequency: 8.3950 27.4215 32.7014 40.1444 48.2593 52.5327 73.6727 103.3504 116.2769 117.6248 141.1892 160.9540 183.7387 205.2518 214.7932 227.0299 235.2800 258.5674 281.8599 311.3948 312.2362 319.4852 338.3436 344.7104 376.3346 400.2362 408.1122 416.0323 437.4418 440.0399 460.8497 476.9849 507.5700 532.1522 547.6590 591.6716 608.7115 616.7628 626.3211 678.7462 684.3830 692.9997 700.6921 732.1984 745.8776 752.0405 800.7900 818.0476 832.1140 840.5781 841.8503 862.3254 899.0779 907.8694 913.2660 939.1265 958.4295 962.1492 969.3418 971.3426 1002.6644 1028.5140 1040.3817 1053.3919 1066.3479 1072.4131 1078.5102 1086.8116 1093.4511 1120.4389 1129.9449 1147.2767 1161.0105 1163.3240 1198.7803 1215.1104 1224.6400 1243.1423 1257.8270 1271.6234 1286.3758 1287.7492 1300.8766 1307.0505 1313.8688 1326.2491 1335.9769 1343.1907 1352.9236 1361.5493 1362.5699 1370.5605 1375.6478 1410.3977 1430.7054 1432.0833 1446.7399 1458.0300 1460.6258 1461.8518 1465.4719 1475.3270 1480.6293 1523.0432 1539.3483 1553.0201 1567.6616 1659.4183 1676.7870 2851.4902 2856.1099 2874.0742 2996.6070 2999.0085 3006.6188 3024.1540 3036.3052 3040.3960 3081.4497 3103.4092 3127.8330 3146.8926 3151.9068 3153.5404 3170.4784 3176.7937
redmass: 5.7771 6.8672 4.3942 5.8713 5.3536 4.8882 6.6189 6.2352 7.3992 8.3563 5.1821 3.3924 8.6002 4.0889 1.5785 10.6734 2.0278 6.7873 6.7272 2.5257 9.2136 2.5334 5.5812 3.3221 4.9940 4.3718 2.2195 4.7946 7.0648 10.2397 4.4429 2.8572 3.1621 9.8033 4.0298 7.1647 4.1092 8.0140 3.6004 10.6682 5.8279 7.0752 8.6593 6.4107 3.4963 4.6440 5.7432 4.7823 1.7422 2.2559 2.9836 1.4146 4.9876 1.4096 3.4664 2.7911 1.6188 1.4995 4.0569 3.9957 2.4806 3.3986 2.5589 1.7384 1.7056 3.6827 2.1121 3.4393 2.6109 2.3197 2.4370 2.5621 1.4845 2.7977 1.1038 1.8518 3.0609 3.4446 1.8646 2.9349 1.5045 1.4623 1.5843 1.2791 3.9052 3.8625 1.2647 2.8594 1.3484 1.8893 1.5892 1.4760 3.2205 2.6706 2.0261 1.1722 2.3295 1.0780 1.0819 1.0678 1.0897 1.1031 1.0533 11.8443 6.6286 5.9450 6.3367 9.5765 12.7559 1.0712 1.0657 1.0597 1.0665 1.0685 1.0832 1.0741 1.0882 1.0904 1.1010 1.0974 1.0948 1.0889 1.0928 1.0919 1.0984 1.0972
irintensity: 0.2538 0.2327 1.2445 2.6188 0.6715 0.3052 1.0298 0.5420 3.5546 3.0879 0.0477 2.3217 0.9112 2.6881 0.9161 0.0476 5.9484 0.1661 1.2199 11.2554 11.1170 9.5086 0.3884 7.9863 1.0189 10.2014 0.5668 11.3128 12.5327 27.3855 2.1209 0.2696 10.5012 1.4015 8.7043 5.8082 3.8134 2.1219 1.0312 14.8138 13.0633 15.2954 1.9027 10.0040 8.1456 4.4894 9.9485 50.3476 39.2737 21.2415 6.7706 35.5569 31.2962 2.7554 7.6574 76.8057 19.6315 2.0432 22.3710 399.9599 45.3579 1.8115 154.6866 11.2013 7.2462 154.4501 26.8330 12.1696 23.8254 72.6280 2.4857 48.7742 25.7082 12.8533 4.7352 165.7706 13.0284 39.6532 53.6563 45.0142 15.7920 37.5371 1.5230 24.2125 64.6864 21.2895 3.0346 32.4263 2.8198 115.0015 93.1564 3.6834 23.6623 123.0639 7.5894 4.2572 275.2408 0.4600 9.2675 31.3731 32.2184 9.1573 9.0935 1.3207 1.0599 41.8236 24.1945 508.1194 226.8054 46.4744 50.4221 183.3449 12.4644 47.7633 41.5348 44.2624 44.9398 44.1663 30.2223 4.9011 3.4768 0.3934 5.7324 7.1655 33.4083 1.7830
temp: 298.150 k
press: 1.00000 atm
elementType: 17 8 8 8 7 7 7 7 7 7 6 6 6 6 6 6 6 6 6 6 6 6 6 6 6 6 6 1 1 1 1 1 1 1 1 1 1 1 1 1 1 1 1 1
symmnumber: 1
zpe: 866836.5 jmol-1
zpe.correction: 0.330161 hartree
zpe.thermalcorrener: 0.353698 hartree
zpe.thermalcorrenthalpy: 0.354642 hartree
zpe.thermalcorrgfe: 0.273791 hartree
zpe.sumelectzpe: -1670.274170 hartree
zpe.sumelectthermal: -1670.250633 hartree
zpe.sumelectthermalent: -1670.249689 hartree
zpe.sumelectthermalfe: -1670.330539 hartree
dipole: 7.6996 -1.2238 1.2272
dipole: 7.8922
quadrupole: -161.7773 -155.5533 -166.0417
quadrupole: 11.5545 -10.7499 4.3825
quadrupole: -0.6532 5.5708 -4.9176 11.5545 -10.7499 4.3825
hfenergy: -1670.6043303 hartree
pointgroup: C01 [X(C17H17Cl1N6O3)]
dipole: 3.0446635 -0.5439793 0.2745358 debye
polarizability: 286.1007651|43.3707864|311.3726337|9.9414496|-31.0989407|169.6206046 unknown
InChI: InChI=1S/C17H17ClN6O3/c1-22-6-8-23(9-7-22)17(26)27-16-14-13(19-4-5-20-14)15(25)24(16)12-3-2-11(18)10-21-12/h2-5,10,16H,6-9H2,1H3
charge 0 multiplicity 1
44 atoms
Cl -5.18212 -3.754776 0.404291
O  0.585424 0.138503 -0.090505
O  0.964039 -0.927242 1.986677
O  -3.213488 2.625471 -0.888056
N  2.068718 -1.624806 0.035699
N  4.590875 -2.503063 -0.993376
N  -1.648021 1.079831 0.10554
N  1.399864 3.05326 0.524655
N  -0.749988 4.500078 -0.798184
N  -3.403587 -0.265673 -0.741864
C  2.363009 -1.482829 -1.408292
C  2.805305 -2.714774 0.714928
C  3.885144 -1.359501 -1.619609
C  4.316773 -2.561315 0.462583
C  -0.262789 1.116147 0.616481
C  1.212844 -0.837878 0.750979
C  6.035212 -2.51047 -1.297943
C  0.180832 2.518117 0.270515
C  -0.863649 3.215514 -0.369789
C  -2.078186 2.330133 -0.470341
C  -2.44905 -0.093815 0.215258
C  -2.23112 -1.030808 1.262594
C  1.531131 4.349592 0.092947
C  0.479811 5.054383 -0.554748
C  -3.063227 -2.165874 1.326363
C  -4.214507 -1.352865 -0.665634
C  -4.073142 -2.315426 0.355403
H  1.838009 -0.601838 -1.802152
H  1.997892 -2.386586 -1.933928
H  2.463948 -3.6849 0.30466
H  2.574818 -2.673609 1.791021
H  4.09603 -1.362874 -2.704891
H  4.234172 -0.378814 -1.204587
H  4.685949 -1.646177 0.993154
H  4.842225 -3.435412 0.889362
H  -0.19416 0.89041 1.698699
H  6.183562 -2.539808 -2.39207
H  6.500484 -3.414765 -0.866995
H  6.577718 -1.61725 -0.898065
H  -1.434747 -0.900768 2.001013
H  2.498049 4.828546 0.274685
H  0.621404 6.087828 -0.886043
H  -2.928648 -2.909114 2.117026
H  -4.977013 -1.45488 -1.444561
