program: Gaussian 09
title: 000040447
version: EM64L-G09RevD.01
frameworkgroup: C1[X(C21H31N)]
method: RPBEPBE
basis: SDD
operation: Freq
keyword: #pfreq=noraman
keyword: PBEPBE/SDD
title: #p freq=noraman PBEPBE/SDD
converged: YES YES NO NO
title: Mulliken charges:
elementType: N C C C C C C C C C C C C C C C C C C C C C H H H H H H H H H H H H H H H H H H H H H H H H H H H H H H H
charge: -0.077153 0.415852 -0.168276 -0.265114 -0.079488 -0.086505 -0.576421 -0.533723 -0.485436 -0.464348 -0.478767 -0.487456 0.479918 -0.413867 -0.383705 -0.466015 -0.368531 -0.262566 -0.237211 -0.249709 -0.623095 -0.617911 0.217647 0.195691 0.193664 0.193154 0.214364 0.201785 0.197113 0.201466 0.201380 0.200081 0.216704 0.196821 0.196826 0.197747 0.181649 0.208991 0.223216 0.222053 0.224055 0.228216 0.205706 0.179925 0.221979 0.223356 0.226920 0.216172 0.228966 0.186132 0.218711 0.184266 0.224774
chargesum: 0.00000
title: Mulliken charges with hydrogens summed into heavy atoms:
elementType: N C C C C C C C C C C C C C C C C C C C C C
charge: -0.077153 0.415852 0.049371 -0.069423 0.114176 0.106649 -0.160272 -0.135144 -0.083976 -0.050823 -0.084194 -0.096816 0.479918 0.031401 -0.159650 -0.237799 0.017099 -0.040587 -0.013855 -0.022789 0.008176 0.009840
polarizability: 2.30832702e+02 2.34130384e+01 2.32835185e+02 1.00162649e+01 -4.81863821e+00 1.91010803e+02
1716.lowfreq: -20.2334 -16.4525 -0.0006 -0.0005 -0.0003 7.8260 15.4792 24.1325 28.3954
frequency: -15.7796 22.9101 27.6122 67.1291 74.2822 100.1257 106.6698 119.8013 173.9554 194.1905 216.7196 219.4379 240.0176 250.5612 264.5849 281.1727 310.9383 338.1159 368.8206 369.4420 387.8429 402.6611 407.5677 415.3926 440.8132 449.9082 465.2329 501.9376 535.0923 589.9704 609.5914 617.8184 638.6699 659.0699 707.0922 733.3563 744.7205 754.1460 780.5575 793.3296 814.9382 823.9365 837.1770 845.3303 850.4749 867.9006 876.5883 913.4346 917.5380 933.2071 941.9436 944.0932 969.9102 972.9355 990.0673 991.1093 993.8627 1016.5626 1021.7949 1030.8998 1031.5252 1038.7941 1051.6714 1060.7108 1069.9761 1071.8625 1081.7727 1090.5787 1095.0232 1100.7402 1106.8008 1111.9936 1124.8649 1133.1750 1146.7388 1160.1133 1170.3770 1183.9321 1192.4494 1195.7147 1212.0073 1230.9034 1242.1290 1242.5392 1262.6839 1274.9134 1278.6006 1287.7001 1293.5731 1301.1241 1302.1438 1310.3305 1312.4463 1315.8307 1325.4494 1339.0441 1341.8971 1344.8727 1354.7972 1356.2474 1361.3734 1363.7180 1373.2749 1390.7538 1416.4608 1439.9144 1440.7669 1455.9882 1458.5286 1459.2657 1460.8685 1461.7837 1468.8585 1471.1339 1473.3026 1475.2660 1480.1930 1481.3929 1486.9391 1490.8089 1586.2584 1610.1092 2819.0034 2837.8380 2854.9010 2944.7352 2952.1910 2957.8953 2959.1832 2960.9838 2963.8564 2970.4559 2989.2093 2990.9566 2993.6107 2997.0899 3001.8219 3002.2686 3014.8941 3015.9169 3021.0510 3023.6880 3027.0735 3030.9378 3034.8184 3059.5796 3074.4736 3086.7569 3102.6311 3121.7150 3134.7617 3155.3055 3172.4180
redmass: 2.5253 4.1682 3.6138 3.5688 3.5905 3.5509 1.9800 2.4581 3.0598 3.5939 2.4647 1.2848 1.2203 4.0365 3.2314 2.4753 2.3863 2.2287 2.0141 2.3177 2.5639 3.7040 2.9480 2.2413 2.4698 1.8550 2.7127 2.9172 3.0295 3.2922 6.3116 6.1784 3.8399 4.2477 1.6513 2.0337 1.5692 2.4394 3.0447 2.6834 3.3659 2.6014 2.9416 1.5338 1.2666 1.5930 1.5663 2.0869 1.9280 2.0614 2.1388 2.3842 2.1384 1.4199 4.7037 1.4117 2.5095 2.4936 1.9884 1.9312 1.7040 2.5885 2.1239 1.8264 1.6485 2.0460 1.6471 1.3826 1.5357 1.4703 1.3269 1.0294 1.1930 2.4654 1.5306 1.4165 1.0651 1.5041 1.2175 1.4905 1.8184 1.8675 1.3825 1.4135 2.4123 1.5548 1.8412 1.6781 1.4939 1.7391 1.4815 1.5489 1.4221 1.5163 1.3156 1.4475 1.4441 1.4277 1.4582 1.8446 1.5375 1.5660 1.4082 2.5430 1.1425 1.9693 1.1717 1.0863 1.0768 1.0704 1.0684 1.0822 1.1294 1.0821 1.0869 1.0561 1.5928 1.1260 1.0874 1.1883 5.6217 6.1820 1.0696 1.0579 1.0581 1.0607 1.0817 1.0630 1.0637 1.0607 1.0645 1.0650 1.0834 1.0832 1.0653 1.0940 1.0836 1.0836 1.0712 1.1025 1.1012 1.1000 1.0719 1.0996 1.0949 1.1034 1.1009 1.0997 1.0879 1.0860 1.0928 1.0978 1.0949
irintensity: 0.4353 0.0762 0.1607 0.0985 0.3047 0.1022 0.4538 0.2971 0.3763 0.0558 0.0264 1.3948 0.7522 0.1891 0.7733 0.2006 3.2557 6.6036 0.3703 0.2061 0.1146 0.3776 0.1002 0.2508 0.2408 0.3370 1.6755 4.5024 12.2651 0.9322 1.3436 0.1536 1.4203 1.4992 55.2742 9.4608 8.6932 30.6890 6.2493 1.2486 9.0139 4.6278 0.7358 2.9797 0.6661 0.1614 0.0548 0.2849 2.0282 0.8808 1.1468 1.3795 9.2173 1.2668 0.8658 0.6207 2.5806 19.4201 2.4650 10.0524 15.0865 2.1176 0.8798 3.5064 0.3263 17.1588 4.6830 2.4234 10.2024 6.2892 8.9563 0.4374 5.3512 3.1493 3.8836 4.7264 0.1209 1.5729 0.7245 3.0007 1.1096 5.0959 3.6489 1.7488 5.5620 1.8703 0.1877 6.9486 3.1491 2.5867 9.5894 0.0597 1.4233 1.2235 0.0306 0.4449 0.7365 3.2711 1.8592 0.8661 2.2900 0.6453 16.8624 0.3123 1.7161 6.7764 3.0884 2.9298 4.0196 6.4581 16.4771 2.6225 9.7651 16.3037 7.2607 24.1207 37.9037 5.1046 11.8120 11.6093 2.1998 10.1724 57.5152 71.8753 210.1993 17.3534 24.4877 13.1570 20.8487 27.7672 69.5421 19.5923 130.0656 127.6329 10.7043 32.2017 22.0931 89.7978 50.0639 0.9343 47.9480 67.3017 53.4750 35.0639 75.8247 60.1949 39.9359 52.0355 12.6300 0.2549 28.8573 43.4426 10.8304
temp: 298.150 k
press: 1.00000 atm
elementType: 7 6 6 6 6 6 6 6 6 6 6 6 6 6 6 6 6 6 6 6 6 6 1 1 1 1 1 1 1 1 1 1 1 1 1 1 1 1 1 1 1 1 1 1 1 1 1 1 1 1 1 1 1
symmnumber: 1
zpe: 1240898.3 jmol-1
zpe.correction: 0.472633 hartree
zpe.thermalcorrener: 0.492168 hartree
zpe.thermalcorrenthalpy: 0.493112 hartree
zpe.thermalcorrgfe: 0.424820 hartree
zpe.sumelectzpe: -871.885482 hartree
zpe.sumelectthermal: -871.865948 hartree
zpe.sumelectthermalent: -871.865004 hartree
zpe.sumelectthermalfe: -871.933295 hartree
dipole: -0.1741 0.2448 -0.4577
dipole: 0.5475
quadrupole: -132.3475 -135.0135 -132.1458
quadrupole: 4.9914 0.6138 0.9785
quadrupole: 0.8214 -1.8446 1.0232 4.9914 0.6138 0.9785
hfenergy: -872.3581157 hartree
pointgroup: C01 [X(C21H31N1)]
dipole: 0.060557 -0.1041464 -0.178567 debye
polarizability: 233.8733181|23.1773957|229.846232|-10.4066491|4.5893644|190.9591397 unknown
InChI: InChI=1S/C21H31N/c1-22(2)10-6-9-21-14-16-11-17(15-21)13-19(12-16)20(21)18-7-4-3-5-8-18/h3-5,7-8,16-17,19-20H,6,9-15H2,1-2H3
charge 0 multiplicity 1
53 atoms
N  -4.268551 1.784731 0.231388
C  0.791195 0.947436 -0.427744
C  2.39954 -0.398954 1.047664
C  0.89783 -0.241735 0.608168
C  2.709293 2.109113 0.836829
C  3.243239 0.605211 -1.125266
C  1.244118 2.234466 0.335859
C  1.783103 0.764983 -1.620253
C  2.827868 0.89389 1.794748
C  3.340932 -0.612418 -0.167948
C  3.661178 1.895307 -0.371241
C  -0.643814 1.114755 -1.002453
C  0.232062 -1.57732 0.259675
C  -1.784465 1.326037 0.02019
C  0.455933 -2.320487 -0.932803
C  -0.648865 -2.148526 1.221266
C  -3.141717 1.499984 -0.692633
C  -0.172464 -3.56783 -1.150004
C  -1.276946 -3.395848 1.013493
C  -1.042077 -4.114999 -0.18041
C  -4.617218 0.63523 1.090945
C  -5.452803 2.295159 -0.48989
H  2.474717 -1.266549 1.7329
H  0.366653 0.114827 1.516356
H  2.991255 3.035984 1.37531
H  3.912621 0.449291 -1.994903
H  0.574164 2.421378 1.198271
H  1.151364 3.108044 -0.342177
H  1.711351 1.660706 -2.272458
H  1.486814 -0.094477 -2.250129
H  3.872685 0.794119 2.151898
H  2.189222 1.046914 2.688045
H  3.088248 -1.548957 -0.700281
H  4.383211 -0.723861 0.193518
H  3.613603 2.766738 -1.055299
H  4.709028 1.811471 -0.018793
H  -0.62836 1.977712 -1.703242
H  -0.882907 0.221345 -1.616116
H  -1.826265 0.458158 0.704062
H  -1.606341 2.226137 0.637712
H  1.121496 -1.935475 -1.709221
H  -0.838598 -1.600745 2.154008
H  -3.062979 2.357238 -1.390557
H  -3.34612 0.590686 -1.320206
H  0.020008 -4.113646 -2.081208
H  -1.948308 -3.802835 1.778473
H  -1.527041 -5.082593 -0.351723
H  -5.435833 0.922878 1.7751
H  -3.75176 0.338752 1.706618
H  -4.950266 -0.262772 0.508127
H  -6.240854 2.569117 0.234994
H  -5.891259 1.555865 -1.209774
H  -5.180419 3.202764 -1.057988
