program: Gaussian 09
title: 000040385
version: EM64L-G09RevD.01
frameworkgroup: C1[X(C15H13N3O2)]
method: RPBEPBE
basis: SDD
operation: Freq
keyword: #p
keyword: freq=noraman
keyword: PBEPBE/SDD
title: #p freq=noraman PBEPBE/SDD
converged: YES YES NO NO
title: Mulliken charges:
elementType: O O N N N C C C C C C C C C C C C C C C H H H H H H H H H H H H H
charge: -0.435733 -0.332125 -0.461157 -0.441312 -0.053150 0.124555 -0.458241 0.297898 0.003386 0.342074 -0.374950 -0.348394 0.071474 -0.345945 -0.213717 -0.232805 -0.301548 -0.223770 -0.256490 0.142080 0.266193 0.234113 0.327157 0.367983 0.235106 0.249213 0.246536 0.224252 0.225869 0.273364 0.228693 0.234279 0.385111
chargesum: 0.00000
title: Mulliken charges with hydrogens summed into heavy atoms:
elementType: O O N N N C C C C C C C C C C C C C C C
charge: -0.050621 -0.332125 -0.133999 -0.073329 -0.053150 0.124555 0.042065 0.297898 0.003386 0.342074 -0.139845 -0.099180 0.071474 -0.099409 0.010535 -0.006936 -0.028184 0.004923 -0.022211 0.142080
polarizability: 2.98141127e+02 1.76149069e+01 1.97177557e+02 -1.69268313e+01 1.00535908e+01 9.71081784e+01
1716.lowfreq: -7.3456 -3.4445 -0.0006 -0.0005 -0.0003 2.6334 22.0548 24.9427 38.5101
frequency: 22.0420 24.8733 38.4994 84.8094 112.6684 132.2084 143.5070 178.7702 204.4086 251.5254 257.5840 268.8338 315.4512 373.4816 407.0427 423.5237 434.7294 481.1610 516.8387 523.2372 540.2491 571.0079 579.9268 585.8574 610.8868 613.7979 624.6311 663.1860 682.0067 698.1949 738.7083 752.7104 756.3197 760.8220 772.3351 779.8212 824.1227 849.0902 855.5247 859.3942 882.2341 938.7315 963.8044 966.7492 977.8035 987.8932 1001.6479 1007.4239 1010.1364 1042.8790 1082.1865 1110.7320 1131.0216 1159.5351 1166.3385 1178.1220 1205.1413 1209.0584 1222.5787 1254.1837 1260.5015 1304.4057 1317.2380 1333.9195 1343.6522 1373.4257 1396.2824 1413.6256 1442.4769 1446.9329 1451.0553 1476.1619 1479.8964 1518.4727 1534.3638 1580.0112 1595.0031 1597.7645 1635.0248 1637.5856 2953.4866 3006.1570 3131.4759 3133.1236 3144.1677 3156.8505 3159.1143 3168.1425 3172.3692 3181.0251 3330.7614 3533.7294 3580.4855
redmass: 5.3818 5.0115 5.9350 8.3591 4.9597 5.0126 5.3368 4.4568 4.5367 4.4860 5.0781 4.6068 4.4416 6.9544 6.3094 3.0800 3.0274 5.1616 6.3046 3.0200 4.6861 1.1911 3.8751 5.1457 5.5042 6.1783 1.3217 3.6239 4.0517 4.9475 1.3706 3.8296 1.4368 1.6227 3.6074 2.0634 4.2788 4.8696 1.5253 1.5159 5.6155 1.3827 4.3759 1.4200 1.3059 1.3376 1.9424 4.8422 2.1414 2.2081 3.8109 1.6367 1.9067 1.1533 1.5562 1.1102 1.9348 1.5007 1.4173 1.5997 2.7163 2.1125 1.8878 1.8374 2.2851 2.6471 6.1801 2.9705 3.0959 2.7791 2.4295 3.0317 1.1388 3.1937 5.4444 6.8727 7.0259 2.6958 7.3664 5.9123 1.0608 1.0988 1.0854 1.0869 1.0904 1.0894 1.0959 1.0943 1.0994 1.0989 1.0805 1.0641 1.0815
irintensity: 1.8614 1.5222 0.2980 2.0392 0.4676 5.6097 3.4214 2.2573 4.2470 6.2185 2.6274 2.9022 1.6916 19.7828 1.9062 9.2419 10.0463 20.6722 5.0648 10.7780 2.0757 116.6419 4.2349 14.5210 16.5206 13.6007 92.3798 32.2207 39.1073 10.2163 33.5653 3.0947 114.3493 126.5155 4.1325 7.5676 5.1651 1.6194 1.3045 0.1066 0.5347 3.9550 1.6842 1.8127 0.0655 0.3170 28.0048 229.4656 3.4955 19.4414 86.2115 2.0298 87.3601 1.7643 107.6401 3.9422 2.9781 42.7681 13.6458 32.4534 24.8053 14.9610 42.0635 159.9020 55.3397 66.4873 10.6413 2.0204 42.4070 30.2445 43.6520 15.0776 65.2292 308.8668 7.8784 141.6640 2.3502 145.6527 14.7363 326.1152 31.8764 17.4430 0.5639 9.2341 11.3973 14.7363 22.9890 13.7855 22.0023 11.2743 95.2099 59.8233 59.8196
temp: 298.150 k
press: 1.00000 atm
elementType: 8 8 7 7 7 6 6 6 6 6 6 6 6 6 6 6 6 6 6 6 1 1 1 1 1 1 1 1 1 1 1 1 1
symmnumber: 1
zpe: 667520.3 jmol-1
zpe.correction: 0.254245 hartree
zpe.thermalcorrener: 0.270420 hartree
zpe.thermalcorrenthalpy: 0.271364 hartree
zpe.thermalcorrgfe: 0.208536 hartree
zpe.sumelectzpe: -892.739077 hartree
zpe.sumelectthermal: -892.722902 hartree
zpe.sumelectthermalent: -892.721958 hartree
zpe.sumelectthermalfe: -892.784786 hartree
dipole: -1.8888 1.1513 1.9581
dipole: 2.9542
quadrupole: -107.8613 -105.6730 -119.5395
quadrupole: 7.3313 1.6181 0.4823
quadrupole: 3.1633 5.3516 -8.5149 7.3313 1.6181 0.4823
hfenergy: -892.9933221 hartree
pointgroup: C01 [X(C15H13N3O2)]
dipole: 0.7123422 -0.1572684 0.9048394 debye
polarizability: 297.4932893|23.2476903|178.0599495|15.6099502|-39.7339619|116.8736237 unknown
InChI: InChI=1S/C15H13N3O2/c19-15(20)10-5-1-2-6-11(10)16-9-14-17-12-7-3-4-8-13(12)18-14/h1-8,16-17,19H,9H2
charge 0 multiplicity 1
33 atoms
O  3.666108 -2.810826 0.819285
O  1.502103 -2.21527 0.264357
N  -1.712565 0.050185 0.556262
N  1.022706 0.339977 -0.346977
N  -2.405927 1.229406 -1.273507
C  -1.355325 0.887388 -0.511922
C  0.052872 1.37705 -0.715085
C  -3.09663 -0.167692 0.474688
C  -3.517806 0.587514 -0.674612
C  2.370442 0.571921 -0.149031
C  -3.995944 -0.921885 1.255556
C  -4.878782 0.594055 -1.054807
C  3.253227 -0.510159 0.240443
C  2.940807 1.874785 -0.31578
C  -5.350581 -0.900469 0.859171
C  -5.785232 -0.154885 -0.276366
C  4.638165 -0.252541 0.450249
C  4.308588 2.094465 -0.09497
C  5.172286 1.034015 0.2916
C  2.716545 -1.859546 0.425206
H  0.145265 1.697488 -1.771728
H  0.220792 2.27728 -0.087438
H  -1.06696 -0.343068 1.24062
H  0.737792 -0.653073 -0.328212
H  -3.671241 -1.499613 2.127157
H  -5.20517 1.166106 -1.928486
H  2.309307 2.707225 -0.638113
H  -6.08628 -1.470613 1.437091
H  -6.84664 -0.167891 -0.546715
H  5.275914 -1.091667 0.741843
H  4.71452 3.10319 -0.233629
H  6.237903 1.218238 0.456394
H  3.20744 -3.688689 0.907455
