program: Gaussian 09
title: 000005666
version: EM64L-G09RevD.01
frameworkgroup: C1[X(C13H19NO3)]
method: RPBEPBE
basis: SDD
operation: Freq
keyword: #p
keyword: freq=noraman
keyword: PBEPBE/SDD
title: #p freq=noraman PBEPBE/SDD
converged: YES YES NO NO
title: Mulliken charges:
elementType: O O O N C C C C C C C C C C C C C H H H H H H H H H H H H H H H H H H H
charge: -0.271285 -0.276765 -0.292495 -0.264552 0.002922 -0.464824 -0.420961 -0.332891 -0.279211 0.273143 0.183061 -0.332560 -0.342081 -0.255277 -0.228624 -0.247578 -0.676156 0.203574 0.217008 0.226675 0.217552 0.227351 0.228584 0.198339 0.216483 0.179839 0.256269 0.245071 0.249174 0.223128 0.226295 0.194382 0.260286 0.203154 0.227632 0.225334
chargesum: 0.00000
title: Mulliken charges with hydrogens summed into heavy atoms:
elementType: O O O N C C C C C C C C C C C C C
charge: -0.271285 -0.276765 -0.292495 -0.008282 0.206495 -0.021141 0.023942 0.094033 0.117111 0.273143 0.183061 -0.087489 -0.092907 -0.032148 -0.002329 0.207090 -0.020035
polarizability: 2.00514831e+02 1.58807345e+01 1.73300748e+02 -2.18664273e+00 -4.06377438e+00 1.02975731e+02
1716.lowfreq: -14.0550 -0.0003 0.0005 0.0007 1.5428 7.6090 19.9607 30.5737 40.5459
frequency: 17.6414 30.3980 40.3942 58.7720 77.6706 109.2328 117.6154 149.7058 195.7986 208.8397 232.7758 239.9237 247.4934 301.9682 316.9383 329.1922 364.5312 435.7563 448.7421 462.7363 469.6255 511.0515 547.0102 564.0414 589.6590 606.5426 657.1486 718.3622 738.2504 752.9367 766.6816 796.6449 816.1013 840.8525 846.6656 866.7621 882.9486 921.3659 944.4717 957.0765 964.0346 991.6541 1019.5408 1023.1073 1035.4280 1039.0970 1066.5991 1096.7238 1105.3272 1114.0839 1125.6916 1132.1980 1139.0466 1164.5824 1182.0874 1185.7472 1213.2643 1235.9456 1249.4551 1256.3645 1261.9792 1264.9708 1309.0646 1322.1706 1335.4720 1354.1458 1358.8078 1363.8401 1371.1416 1392.7079 1394.9414 1434.8910 1435.4288 1441.2555 1443.6034 1455.2653 1456.9252 1458.1295 1481.6912 1482.9639 1496.6633 1585.9642 1599.9188 2927.8581 2937.0462 2954.4814 2974.3458 2981.3884 2991.7591 2992.0083 3024.1168 3051.3939 3058.2699 3063.7033 3067.2727 3089.6442 3101.7550 3132.1042 3146.4985 3159.1445 3171.9519 3430.5348
redmass: 3.8498 3.9938 3.0141 2.8327 3.1522 4.0146 3.1289 3.8751 5.2278 3.3215 1.7402 1.7603 2.2533 3.8492 3.6576 1.8978 4.5487 6.6568 3.5096 2.9195 2.7834 2.9002 4.8184 3.3428 2.6799 2.6832 2.1953 3.9900 2.7629 1.5181 3.2840 4.2977 1.1035 1.5463 1.8126 2.2351 4.1855 1.3857 1.8996 3.5579 1.3034 4.5404 2.1095 2.5646 2.7532 2.0134 3.6032 2.2446 2.3215 2.1489 2.1981 1.4272 4.3960 1.1666 1.6792 1.4230 1.1516 2.9547 1.1826 1.1837 1.2705 1.5051 1.3311 1.2147 1.2588 1.2481 1.2814 1.3036 3.5701 1.3290 1.8612 1.3198 1.6305 1.1013 1.1144 1.1463 1.1583 1.0436 1.2165 1.8399 1.0941 7.1260 6.4275 1.0691 1.0819 1.0568 1.0638 1.0604 1.0601 1.0369 1.1048 1.1033 1.1009 1.0993 1.0987 1.0984 1.1017 1.0848 1.0896 1.0941 1.1002 1.0745
irintensity: 1.2040 0.2685 0.5371 0.3756 5.1927 3.1939 2.9725 0.3850 1.9517 3.4616 0.5336 9.9720 6.7323 0.1336 2.5540 11.1451 7.3322 0.1689 1.4835 7.6293 3.0095 0.1844 0.0243 3.2836 8.8859 25.1626 201.7345 3.7773 25.2505 87.3669 14.7912 18.9070 3.0447 0.8712 6.3713 6.1971 31.1386 3.9745 15.3831 40.5024 0.1635 38.8048 26.3334 50.5082 34.3606 33.2595 24.8050 65.1015 14.6949 19.3298 1.1603 12.0371 20.5569 18.5291 45.2161 25.3627 12.4353 243.6711 7.8773 6.3195 19.2119 14.3968 3.1804 9.8088 2.3905 0.9604 1.4560 8.3722 6.8753 24.6530 14.0502 11.3918 19.7281 11.8362 11.2972 2.2667 57.5354 11.7192 20.2846 106.6392 3.4319 7.4265 27.6675 52.7467 44.3273 36.4826 48.3505 49.6712 46.5275 29.8497 20.7256 42.6620 42.0269 3.9491 43.2213 35.1134 41.0795 0.6638 19.2195 25.7425 14.4495 1.2985
temp: 298.150 k
press: 1.00000 atm
elementType: 8 8 8 7 6 6 6 6 6 6 6 6 6 6 6 6 6 1 1 1 1 1 1 1 1 1 1 1 1 1 1 1 1 1 1 1
symmnumber: 1
zpe: 791195.3 jmol-1
zpe.correction: 0.301350 hartree
zpe.thermalcorrener: 0.318318 hartree
zpe.thermalcorrenthalpy: 0.319262 hartree
zpe.thermalcorrgfe: 0.254535 hartree
zpe.sumelectzpe: -785.835954 hartree
zpe.sumelectthermal: -785.818987 hartree
zpe.sumelectthermalent: -785.818042 hartree
zpe.sumelectthermalfe: -785.882770 hartree
dipole: 2.6633 -0.2399 0.1389
dipole: 2.6777
quadrupole: -99.2837 -93.7265 -103.9674
quadrupole: 8.7877 -5.1725 1.0634
quadrupole: -0.2912 5.2661 -4.9749 8.7877 -5.1725 1.0634
hfenergy: -786.1373041 hartree
pointgroup: C01 [X(C13H19N1O3)]
dipole: -1.0315121 -0.1798155 -0.1160833 debye
polarizability: 203.369773|-13.0557712|168.0534935|-1.2191091|13.0917897|105.368043 unknown
InChI: InChI=1S/C13H19NO3/c1-2-15-12-5-3-4-6-13(12)17-10-11-9-14-7-8-16-11/h3-6,11,14H,2,7-10H2,1H3
charge 0 multiplicity 1
36 atoms
O  -2.42108 0.342395 -0.998726
O  0.245859 -0.16899 0.152815
O  2.12189 1.839748 0.777558
N  -4.581996 -1.146527 0.262027
C  -2.118058 -0.625783 0.079809
C  -3.220238 -1.717819 0.12921
C  -4.849854 -0.103149 -0.76006
C  -0.737325 -1.193611 -0.21899
C  -3.742089 0.973022 -0.802652
C  1.605169 -0.450318 -0.06806
C  2.523944 0.597838 0.253809
C  2.093443 -1.689299 -0.546759
C  3.908965 0.362049 0.125244
C  3.485266 -1.904604 -0.677808
C  4.396314 -0.884152 -0.331946
C  1.144805 2.638851 -0.021623
C  0.894334 3.920509 0.768496
H  -2.086869 -0.086643 1.05442
H  -3.185006 -2.307357 -0.808473
H  -3.037493 -2.40905 0.973129
H  -5.834247 0.3587 -0.558945
H  -4.904892 -0.599293 -1.74798
H  -0.655058 -1.433123 -1.29809
H  -0.563633 -2.114178 0.377554
H  -3.860515 1.660251 -1.658051
H  -3.73844 1.562569 0.142424
H  -4.756851 -0.800652 1.21659
H  1.400134 -2.495457 -0.805336
H  4.588323 1.177712 0.393097
H  3.848483 -2.870372 -1.045456
H  5.474958 -1.048108 -0.424541
H  1.599651 2.853574 -1.010307
H  0.221087 2.053119 -0.168292
H  0.184584 4.569617 0.223148
H  0.464881 3.685286 1.75769
H  1.834355 4.478248 0.922774
