program: Gaussian 09
title: 000005662
version: EM64L-G09RevD.01
frameworkgroup: C1[X(C17H25NO)]
method: RPBEPBE
basis: SDD
operation: Freq
keyword: #p
keyword: freq=noraman
keyword: PBEPBE/SDD
title: #p freq=noraman PBEPBE/SDD
converged: YES YES NO NO
title: Mulliken charges:
elementType: O N C C C C C C C C C C C C C C C C C H H H H H H H H H H H H H H H H H H H H H H H H H
charge: -0.461847 -0.169118 -0.058522 -0.065782 -0.445562 -0.361846 -0.380871 -0.213946 -0.464146 -0.456849 -0.433571 -0.413526 -0.387783 0.547331 -0.473180 -0.399968 -0.222811 -0.250540 -0.246786 0.193564 0.180050 0.211170 0.213361 0.218462 0.184758 0.178038 0.239485 0.203971 0.212117 0.214308 0.210327 0.211667 0.187583 0.220583 0.201808 0.186444 0.195286 0.218247 0.342082 0.231061 0.230182 0.223614 0.223478 0.227678
chargesum: 0.00000
title: Mulliken charges with hydrogens summed into heavy atoms:
elementType: O N C C C C C C C C C C C C C C C C C
charge: -0.119764 -0.169118 0.135042 0.114268 -0.021031 0.041374 0.036652 -0.009975 -0.037721 -0.034856 -0.025405 -0.025274 0.025750 0.547331 -0.242120 -0.169786 0.000803 -0.027062 -0.019108
polarizability: 2.56305694e+02 -9.73392398e-01 1.59640850e+02 1.95528408e+00 -1.35118206e+01 1.46069293e+02
1716.lowfreq: -19.2311 -5.6835 0.0003 0.0005 0.0007 7.3014 19.7902 30.8259 43.5564
frequency: 17.7913 30.4461 43.4552 82.9697 86.0069 124.9442 149.1908 186.8569 196.8122 220.2526 241.8441 282.0854 287.7514 299.5880 346.0349 368.3797 384.7727 397.7075 404.0923 453.5086 465.3700 471.7197 510.3944 535.3121 587.9348 616.9304 641.0905 645.3521 673.6667 704.9121 750.2031 769.0211 783.9840 801.8342 804.9326 815.5511 850.3255 857.7057 881.0227 897.1809 908.3113 910.7560 938.4820 953.5228 972.4767 974.4840 985.4423 989.6750 993.1772 997.1476 1026.7057 1036.8752 1047.6934 1065.3095 1070.8683 1093.5357 1103.7044 1106.5693 1112.0428 1122.5517 1125.3862 1141.7193 1161.4213 1171.4104 1189.2512 1207.1388 1208.2516 1240.1762 1244.9468 1253.5756 1254.8418 1260.9525 1272.2732 1288.6001 1300.8945 1305.4575 1307.9515 1326.3696 1331.7282 1334.3855 1338.2603 1343.1618 1347.1516 1357.6166 1360.4499 1365.8274 1379.5519 1386.0316 1403.9897 1442.3568 1447.9091 1449.2028 1458.4367 1458.7225 1465.9244 1468.6103 1474.4536 1478.1222 1483.2589 1591.6103 1613.4446 2846.8724 2854.5279 2874.4446 2918.3750 2956.3922 2960.2263 2974.7814 2981.2313 2988.3460 2989.9606 2991.7948 3029.8704 3043.0392 3046.8847 3048.9839 3051.1491 3055.4755 3056.6543 3077.7299 3112.8626 3114.5648 3130.6741 3141.5736 3160.9969 3300.8605
redmass: 3.7807 4.5861 3.7148 3.2017 3.8167 3.8661 3.5461 4.9819 2.9510 2.6875 2.1241 3.1565 2.8702 2.3679 2.6621 2.5566 2.2268 2.9678 2.8010 2.7883 2.3994 2.1963 2.9315 3.0346 3.3569 6.4004 3.0210 1.5186 1.6489 1.6509 2.4945 1.9642 3.2362 2.5353 1.5223 1.9316 1.2489 2.5606 2.8625 2.4337 1.5319 1.6234 1.6933 2.5296 1.4543 1.9935 1.7959 5.6697 1.3352 2.4540 2.2956 1.9989 1.7676 1.8703 1.7779 2.2347 1.7287 2.3907 1.9844 1.5840 2.1281 2.4328 1.3799 1.0556 1.1110 1.4766 1.8735 1.2986 1.4362 1.2760 1.2520 1.5569 1.3280 1.1871 1.3012 1.2928 1.3174 1.3589 1.3049 1.2870 1.4166 1.3176 1.4595 1.5057 1.6042 1.5495 1.5947 3.6929 1.5379 2.1209 1.0910 1.0853 1.0982 1.0912 1.0796 1.0864 1.0916 1.1117 2.2206 5.9332 6.1448 1.0720 1.0719 1.0797 1.0831 1.0828 1.0639 1.0652 1.0603 1.0594 1.0620 1.0604 1.0956 1.0990 1.1007 1.0980 1.0921 1.1021 1.1031 1.0874 1.0866 1.0870 1.0906 1.0958 1.1014 1.0636
irintensity: 0.1118 0.3690 0.8062 0.2141 0.7595 0.5658 2.9292 0.1452 1.8176 1.4257 0.2213 1.4912 4.9441 3.8033 0.3160 2.0728 7.9148 0.6403 0.0150 2.5245 1.2545 1.0565 3.8234 13.0280 5.2589 0.1208 1.8886 34.3011 48.1466 56.6916 7.9437 44.5703 4.1507 2.1233 0.7845 8.6171 0.0080 9.1206 0.7569 7.8916 2.9914 16.8679 5.5985 14.5005 5.1603 35.7103 8.7477 0.7478 0.6107 21.8496 2.2222 2.1702 6.0650 12.1841 9.7843 28.5173 10.7354 1.6942 11.4618 14.1499 2.9863 14.5685 0.4368 0.0381 0.2607 1.0067 1.2520 5.4357 12.0244 7.8193 31.6701 41.2322 2.3716 6.9108 4.4640 1.9695 10.0344 6.4203 3.6677 2.2129 1.0465 2.7342 4.5974 4.2888 15.0958 11.7064 0.6259 0.1697 24.8611 7.0973 5.8566 9.8362 12.0781 16.1744 0.9065 15.2668 4.3421 10.3281 20.0824 1.7886 12.7398 41.8219 76.4430 93.8403 81.8638 20.8147 43.4973 60.5979 25.1237 29.0011 46.4989 22.4079 59.0800 54.0527 6.6799 48.4613 6.6627 38.2827 81.9077 23.4248 10.2403 9.4332 10.6280 45.7763 27.6602 123.4298
temp: 298.150 k
press: 1.00000 atm
elementType: 8 7 6 6 6 6 6 6 6 6 6 6 6 6 6 6 6 6 6 1 1 1 1 1 1 1 1 1 1 1 1 1 1 1 1 1 1 1 1 1 1 1 1 1
symmnumber: 1
zpe: 1015793.2 jmol-1
zpe.correction: 0.386895 hartree
zpe.thermalcorrener: 0.404209 hartree
zpe.thermalcorrenthalpy: 0.405153 hartree
zpe.thermalcorrgfe: 0.340624 hartree
zpe.sumelectzpe: -791.314865 hartree
zpe.sumelectthermal: -791.297551 hartree
zpe.sumelectthermalent: -791.296607 hartree
zpe.sumelectthermalfe: -791.361136 hartree
dipole: -0.7919 -2.5034 1.3817
dipole: 2.9670
quadrupole: -114.0076 -118.3481 -114.6770
quadrupole: -6.6791 3.9955 -0.9302
quadrupole: 1.6700 -2.6705 1.0005 -6.6791 3.9955 -0.9302
hfenergy: -791.7017606 hartree
pointgroup: C01 [X(C17H25N1O1)]
dipole: -0.3175286 -0.2169424 1.102142 debye
polarizability: 256.2937687|-1.0395755|138.4160718|2.1286545|-4.5112636|167.3059965 unknown
InChI: InChI=1S/C17H25NO/c19-17-9-5-4-8-16(17)18-12-10-15(11-13-18)14-6-2-1-3-7-14/h1-3,6-7,15-17,19H,4-5,8-13H2
charge 0 multiplicity 1
44 atoms
O  2.908404 0.608717 -1.800825
N  1.263774 -0.025405 0.295773
C  2.746573 0.021993 0.574132
C  3.358843 1.018969 -0.465378
C  3.424497 -1.363999 0.455555
C  0.55912 1.173565 0.836513
C  0.547078 -1.261719 0.712806
C  -1.692665 -0.014769 0.703592
C  -0.890794 1.259993 0.324752
C  -0.907874 -1.256376 0.199277
C  4.895644 1.065103 -0.444417
C  4.964328 -1.256114 0.563434
C  5.531217 -0.337244 -0.54041
C  -3.131188 0.018012 0.193878
C  -4.221432 -0.030919 1.099651
C  -3.417056 0.096605 -1.195756
C  -5.557487 -0.00282 0.637722
C  -4.74906 0.125094 -1.66279
C  -5.826818 0.075362 -0.747388
H  2.942424 0.416755 1.602341
H  2.980377 2.043838 -0.250696
H  3.17004 -1.809023 -0.526834
H  3.047519 -2.043167 1.242844
H  1.111232 2.08045 0.53578
H  0.555866 1.145785 1.956738
H  0.542555 -1.3662 1.828725
H  1.067636 -2.140282 0.300502
H  -1.724323 -0.069085 1.813064
H  -1.380682 2.15673 0.749932
H  -0.878087 1.380859 -0.77538
H  -0.895213 -1.260598 -0.907856
H  -1.414916 -2.184084 0.526953
H  5.216483 1.557766 0.497093
H  5.229705 1.707567 -1.280157
H  5.408505 -2.267675 0.494032
H  5.241242 -0.852165 1.560373
H  6.632382 -0.261442 -0.45753
H  5.300526 -0.768729 -1.532928
H  1.972124 0.282302 -1.630272
H  -4.020399 -0.091571 2.176855
H  -2.594067 0.135803 -1.919952
H  -6.384629 -0.041786 1.355909
H  -4.948165 0.186158 -2.738971
H  -6.860841 0.097145 -1.109487
