program: Gaussian 09
title: 000040409
version: EM64L-G09RevD.01
frameworkgroup: C1[X(C19H21NO3S)]
method: RPBEPBE
basis: SDD
operation: Freq
keyword: #p
keyword: freq=noraman
keyword: PBEPBE/SDD
title: #p freq=noraman PBEPBE/SDD
converged: YES YES NO NO
title: Mulliken charges:
elementType: S O O O N C C C C C C C C C C C C C C C C C C C H H H H H H H H H H H H H H H H H H H H H
charge: 0.352262 -0.373893 -0.254994 -0.234892 -0.365934 -0.420910 -0.472835 -0.411942 0.467980 -0.448777 -0.439828 0.089327 -0.261225 0.216162 0.181555 -0.681438 0.486740 -0.204360 -0.386049 -0.428532 -0.694669 -0.213833 -0.221709 -0.247946 0.204328 0.210293 0.248540 0.223521 0.208883 0.211036 0.224950 0.227267 0.402577 0.262247 0.220625 0.232660 0.232744 0.262238 0.225191 0.222723 0.219101 0.241345 0.229556 0.229016 0.230901
chargesum: 0.00000
title: Mulliken charges with hydrogens summed into heavy atoms:
elementType: S O O O N C C C C C C C C C C C C C C C C C C C
charge: 0.352262 -0.373893 -0.254994 -0.234892 0.036643 -0.006290 -0.000775 0.007977 0.467980 0.003439 -0.439828 0.089327 -0.261225 0.216162 0.181555 -0.198565 0.486740 0.261044 -0.123811 -0.203341 -0.011499 0.015722 0.007307 -0.017045
polarizability: 3.11809734e+02 -1.30097953e+01 2.57806736e+02 4.77913687e+00 4.03354591e+00 1.70449442e+02
1716.lowfreq: -10.3152 -1.6668 0.0007 0.0016 0.0021 5.5371 7.5406 21.5095 33.2249
frequency: -2.1111 21.3022 33.1974 40.8238 59.6015 70.3430 75.3166 85.5267 105.9876 112.7765 126.1508 138.0127 170.4893 191.7448 211.4851 247.0673 254.0266 265.5185 287.4137 298.7868 305.2611 323.5840 349.7265 359.9843 373.6226 401.1782 405.1687 450.6772 459.0384 492.7606 511.5414 524.7716 536.5466 572.7906 612.2737 615.7451 660.9756 701.9004 709.0610 726.4747 731.3367 735.9688 761.9105 802.5594 817.5096 818.8491 822.4672 828.3342 831.9683 857.1997 859.2593 900.1323 910.3773 927.0985 949.1097 964.6805 967.4948 979.5002 990.4966 999.2904 1002.3414 1027.3510 1034.0233 1080.3243 1080.5793 1087.2676 1105.3297 1113.5516 1124.5903 1135.8563 1139.9121 1161.6217 1172.8762 1176.2463 1190.9190 1201.7066 1239.0993 1244.3203 1247.9820 1255.4108 1279.0462 1299.0573 1325.6804 1330.8341 1334.8751 1342.3733 1346.8729 1362.3262 1381.2048 1388.0379 1398.2951 1438.7198 1441.5117 1448.6374 1458.1415 1459.6354 1467.7541 1468.1853 1472.3920 1477.2296 1483.0822 1489.0343 1543.4019 1589.3164 1593.4480 1602.6283 1614.1360 1619.5414 2960.7872 2978.6458 2981.4649 2984.4455 2988.9799 3003.5114 3016.5206 3016.9859 3042.4129 3049.7106 3057.9399 3067.7454 3071.5445 3087.5585 3101.0612 3113.8304 3124.9472 3135.4279 3146.1111 3163.8987 3321.0923
redmass: 4.9348 5.3149 3.1395 3.9621 4.9579 3.5376 3.5961 3.9690 5.4388 3.7707 3.2175 3.4297 4.7975 4.7943 4.9870 2.2976 3.9926 1.7536 2.0497 3.2126 6.0553 2.8757 5.2949 7.6509 4.6092 4.4241 2.8691 3.2586 3.2450 4.6969 5.2357 3.2301 4.8248 4.9732 6.6282 6.2978 5.8829 3.4310 2.6278 4.5022 2.3743 6.1258 2.9911 1.1072 2.1617 2.3915 3.3754 3.0966 1.2350 1.2844 2.6072 1.4809 1.7253 2.5314 2.4021 2.5178 3.9088 1.3916 5.9313 1.3342 3.1478 2.2505 2.8438 1.6658 1.9189 3.2794 1.9676 2.3262 1.5346 1.1561 1.4573 1.7494 1.0769 1.9237 1.1562 2.5297 1.2979 2.0586 1.1344 1.3367 1.4716 1.7983 1.5346 1.6608 1.3290 1.4371 1.5705 1.8852 7.3731 4.2745 1.2863 2.7215 2.1786 1.1392 1.1713 1.0861 1.0412 1.0922 1.0935 1.0680 2.1620 1.0947 3.5706 6.2490 6.2414 5.1921 5.9474 10.6012 1.0630 1.0672 1.0640 1.0629 1.0355 1.0602 1.0947 1.0583 1.0966 1.1004 1.0979 1.1016 1.1050 1.0986 1.1043 1.0872 1.0865 1.0916 1.0960 1.1015 1.0793
irintensity: 0.2215 0.2228 0.9895 0.2938 0.1882 3.6542 0.4409 1.0616 3.0160 4.4814 4.3368 2.9055 1.2273 2.5688 7.2791 2.4866 1.5913 0.2202 0.8604 3.7362 10.6437 0.0440 2.1826 2.4178 2.7130 0.1139 0.1218 0.4331 1.2987 8.6606 19.7813 4.0108 2.4646 12.0670 2.0789 0.5401 1.9979 4.9538 31.2805 14.4740 65.0567 1.6159 12.7228 0.7006 1.1932 10.9905 15.5169 5.4737 90.3665 2.2194 18.5907 3.5969 18.3072 79.2212 44.2989 18.4109 11.9138 0.1139 0.4162 0.2639 3.2887 8.5916 110.9698 12.1390 34.4484 99.4952 42.6534 23.7568 51.2972 0.5079 4.6756 19.0882 0.4077 1.6265 3.9079 1.8324 7.2707 5.7101 0.2049 14.1940 13.9044 56.5272 27.3560 103.5234 31.2509 8.1572 9.3865 55.1752 13.6086 201.5909 1.9660 44.3703 34.9273 7.5285 16.1164 12.4481 11.9895 14.2810 5.0089 8.7256 23.7075 6.9634 599.3321 23.7719 6.9067 62.8027 72.0760 239.6144 34.9399 32.2292 23.5296 35.9845 15.6576 18.8207 33.9635 19.9761 71.6666 36.4845 38.6471 7.3006 1.2843 35.9740 48.5257 10.1017 0.2055 13.7179 28.9819 23.5363 190.3376
temp: 298.150 k
press: 1.00000 atm
elementType: 16 8 8 8 7 6 6 6 6 6 6 6 6 6 6 6 6 6 6 6 6 6 6 6 1 1 1 1 1 1 1 1 1 1 1 1 1 1 1 1 1 1 1 1 1
symmnumber: 1
zpe: 945262.4 jmol-1
zpe.correction: 0.360031 hartree
zpe.thermalcorrener: 0.382090 hartree
zpe.thermalcorrenthalpy: 0.383035 hartree
zpe.thermalcorrgfe: 0.307455 hartree
zpe.sumelectzpe: -1413.385586 hartree
zpe.sumelectthermal: -1413.363527 hartree
zpe.sumelectthermalent: -1413.362582 hartree
zpe.sumelectthermalfe: -1413.438162 hartree
dipole: -1.7376 2.5452 0.3674
dipole: 3.1036
quadrupole: -131.5660 -150.4895 -144.9032
quadrupole: -15.9145 -0.4324 -8.9539
quadrupole: 10.7536 -8.1699 -2.5836 -15.9145 -0.4324 -8.9539
hfenergy: -1413.7456171 hartree
pointgroup: C01 [X(C19H21N1O3S1)]
dipole: -0.4818651 -1.0623246 -0.360826 debye
polarizability: 303.8866896|24.5950858|259.5829937|-7.0084694|21.6172604|176.596228 unknown
InChI: InChI=1S/C19H21NO3S/c1-2-23-19(22)17-14-10-6-7-11-15(14)24-18(17)20-16(21)12-13-8-4-3-5-9-13/h3-5,8-9,20H,2,6-7,10-12H2,1H3
charge 0 multiplicity 1
45 atoms
S  1.369859 2.192901 0.980293
O  0.418904 -2.204268 -0.069867
O  2.580426 -2.38509 -0.923547
O  -1.270408 2.013036 1.948659
N  -0.434599 0.05713 0.993605
C  5.276204 1.147749 -1.298964
C  4.322254 -0.007591 -0.907779
C  5.429027 2.180299 -0.158113
C  3.063979 0.511072 -0.230964
C  4.068511 2.858886 0.152691
C  2.985912 1.812221 0.225352
C  1.840583 -0.254716 0.01005
C  0.835708 0.508252 0.645209
C  1.707703 -1.663258 -0.378075
C  -1.436366 0.800673 1.616609
C  -2.756185 0.050941 1.825842
C  -3.618261 0.024265 0.560741
C  0.209104 -3.629206 -0.458822
C  -3.890397 1.223692 -0.147098
C  -4.173229 -1.191049 0.088529
C  -1.203843 -4.011335 -0.026523
C  -4.698718 1.2039 -1.304356
C  -4.986611 -1.21119 -1.068282
C  -5.250128 -0.013278 -1.770054
H  4.881872 1.662912 -2.198073
H  6.263252 0.73065 -1.573909
H  4.052291 -0.60657 -1.794945
H  4.836813 -0.716018 -0.227861
H  6.173491 2.95229 -0.429058
H  5.800672 1.66887 0.75156
H  3.832616 3.600958 -0.638325
H  4.133233 3.425141 1.102319
H  -0.60058 -0.92528 0.713057
H  -3.285036 0.583184 2.636199
H  -2.562491 -0.98169 2.171401
H  0.983703 -4.240764 0.036772
H  0.351672 -3.712289 -1.550845
H  -3.465031 2.168622 0.211354
H  -3.982184 -2.123422 0.635446
H  -1.404605 -5.060657 -0.309161
H  -1.32222 -3.924437 1.068303
H  -1.95638 -3.371834 -0.52008
H  -4.899988 2.137144 -1.842223
H  -5.413654 -2.157978 -1.418113
H  -5.878672 -0.026766 -2.667352
