program: Gaussian 09
title: 000040369
version: EM64L-G09RevD.01
frameworkgroup: C1[X(C15H24N2O2)]
method: RPBEPBE
basis: SDD
operation: Freq
keyword: #p
keyword: freq=noraman
keyword: PBEPBE/SDD
title: #p freq=noraman PBEPBE/SDD
converged: YES YES NO NO
title: Mulliken charges:
elementType: O O N N C C C C C C C C C C C C C C C H H H H H H H H H H H H H H H H H H H H H H H H
charge: -0.286791 -0.272466 -0.297095 -0.105725 0.231583 -0.356824 -0.359903 -0.378291 -0.694628 0.207537 0.201434 -0.321857 -0.326797 -0.357738 -0.358219 -0.672420 -0.673659 -0.216301 -0.215781 0.215779 0.228591 0.184615 0.225891 0.179675 0.223767 0.266016 0.253305 0.222015 0.237222 0.186155 0.203398 0.187092 0.205868 0.246465 0.248584 0.205644 0.226860 0.210827 0.205924 0.227447 0.207737 0.227375 0.227687
chargesum: 0.00000
title: Mulliken charges with hydrogens summed into heavy atoms:
elementType: O O N N C C C C C C C C C C C C C C C
charge: -0.286791 -0.272466 -0.031079 -0.105725 0.231583 0.087545 0.050604 0.025151 0.017914 0.207537 0.201434 0.067695 0.066162 -0.111273 -0.109635 -0.029087 -0.032550 0.011074 0.011906
polarizability: 2.30317059e+02 3.05719685e+01 1.70841161e+02 -8.84326663e+00 1.02696618e+01 1.52636852e+02
1716.lowfreq: -4.9644 -1.4096 -0.0005 0.0006 0.0008 7.9384 14.7341 19.8156 35.4663
frequency: 14.4145 19.6833 35.4606 41.8955 66.7555 71.9891 85.2815 118.7217 136.6365 151.8887 168.4829 176.9860 191.0207 220.3080 234.8011 258.0899 279.7833 284.2105 301.0125 315.8543 327.2617 387.0084 413.3521 418.2021 453.3530 473.3867 480.9697 514.2526 549.4590 562.4943 596.3017 652.7530 706.8008 718.1465 732.0918 742.1954 747.5098 767.7840 791.4004 796.3333 802.9756 803.8279 836.2544 841.1330 911.1029 913.6441 929.3501 949.3583 957.5285 985.2232 1007.7965 1025.3750 1040.6479 1053.0951 1073.8150 1076.8340 1083.3867 1085.0652 1105.0490 1113.0897 1144.6127 1155.4267 1160.8161 1162.5881 1191.0767 1207.0666 1217.3765 1235.4988 1243.5594 1270.7872 1274.6012 1283.4390 1289.5447 1294.3571 1313.3794 1351.6080 1362.3398 1369.2799 1384.2236 1386.3618 1387.5647 1393.8569 1411.6739 1444.2062 1449.3851 1452.6025 1459.3745 1463.1747 1463.7560 1466.4844 1468.9834 1470.7512 1476.2889 1480.0915 1485.7909 1489.9949 1492.3924 1604.2644 1625.4010 2841.8525 2846.2712 2860.5456 2870.8689 2885.3200 2981.9450 2983.9094 3008.3590 3024.3746 3025.8595 3032.1869 3033.7795 3057.7782 3074.4273 3076.4013 3091.3343 3091.7728 3110.5872 3124.5534 3139.3131 3157.2940 3174.2917 3181.7641 3435.7911
redmass: 4.6873 3.5578 3.9120 3.5991 2.7743 2.8869 2.0548 2.1384 2.6099 2.7235 1.7513 1.2742 1.5573 1.4391 2.9277 4.1647 3.2145 2.0144 2.4264 2.5470 3.3856 3.6800 3.0267 3.2719 2.7550 3.4230 3.6431 3.3346 4.2138 5.2462 7.1471 5.5172 4.8167 2.2987 2.2787 1.2245 2.2861 4.4587 1.1788 1.1519 3.3063 1.3737 6.3831 1.3468 1.3775 1.9019 1.6028 2.2273 1.2834 2.3138 2.0123 2.2064 2.1745 2.6818 1.9851 1.9439 2.5228 2.1979 1.6205 1.6087 1.7573 3.4232 1.9130 1.2993 2.3969 2.2816 1.9587 3.3035 1.6737 1.4276 1.1871 1.3522 1.3047 1.4238 1.3260 1.3864 1.3308 1.3758 1.3322 1.2328 1.2363 1.4358 4.6077 2.3645 1.0928 1.2055 1.0576 1.0671 1.1472 2.6255 1.0694 1.0766 1.0691 1.0601 1.0602 1.0766 1.0825 7.8872 7.9092 1.0718 1.0721 1.0713 1.0708 1.0703 1.0358 1.0357 1.0356 1.0871 1.0865 1.0883 1.0873 1.0897 1.0983 1.0980 1.1003 1.1002 1.0992 1.1013 1.0858 1.0918 1.0951 1.0992 1.0737
irintensity: 0.0581 0.0603 0.6925 0.1023 0.6330 0.1339 0.2305 5.7966 0.6019 2.4345 0.4842 0.1140 0.4620 0.1728 3.9764 0.8188 4.5486 1.2921 1.7460 0.0765 0.1124 0.1603 5.1310 6.1258 5.9427 2.4699 5.7737 12.4124 0.2991 2.3186 0.3662 1.7631 6.1362 43.2981 43.8710 118.0354 14.3836 12.2308 5.5960 6.4610 58.8929 6.2497 3.5168 0.0760 6.3255 1.5449 1.4587 36.1078 0.0010 7.4114 22.2799 6.3438 4.9398 12.5513 43.7878 26.3770 67.0621 4.9418 1.8621 88.5201 48.0119 40.0953 23.2701 50.9038 56.9301 56.0225 44.7688 218.9701 12.7890 1.1034 3.1355 23.8367 7.8968 41.4212 3.0869 7.3351 1.9897 1.9569 31.3812 26.0308 28.0741 6.2369 13.9450 6.6768 15.8086 94.2606 1.8484 4.0951 19.3792 169.6862 0.1733 9.7263 1.9284 11.9980 7.2218 19.1917 2.8242 1.7208 3.4513 53.6582 40.0192 235.0237 85.7346 99.5746 33.0412 31.5709 6.7048 15.4515 21.2525 20.1569 19.2254 33.2500 44.9376 77.7282 30.8391 52.6377 12.8171 10.8215 2.1482 20.0920 11.9930 6.6231 0.7559
temp: 298.150 k
press: 1.00000 atm
elementType: 8 8 7 7 6 6 6 6 6 6 6 6 6 6 6 6 6 6 6 1 1 1 1 1 1 1 1 1 1 1 1 1 1 1 1 1 1 1 1 1 1 1 1
symmnumber: 1
zpe: 962954.6 jmol-1
zpe.correction: 0.366770 hartree
zpe.thermalcorrener: 0.387408 hartree
zpe.thermalcorrenthalpy: 0.388352 hartree
zpe.thermalcorrgfe: 0.314783 hartree
zpe.sumelectzpe: -844.420032 hartree
zpe.sumelectthermal: -844.399394 hartree
zpe.sumelectthermalent: -844.398450 hartree
zpe.sumelectthermalfe: -844.472019 hartree
dipole: 1.1386 -1.0059 -0.4408
dipole: 1.5819
quadrupole: -110.3322 -112.9075 -115.8350
quadrupole: 3.4595 -3.9152 2.2222
quadrupole: 2.6927 0.1174 -2.8101 3.4595 -3.9152 2.2222
hfenergy: -844.7868019 hartree
pointgroup: C01 [X(C15H24N2O2)]
dipole: 0.4393496 -0.4013012 -0.1824474 debye
polarizability: 230.8862899|29.9120005|169.8768677|-9.8118686|9.9972674|153.0319136 unknown
InChI: InChI=1S/C15H24N2O2/c1-4-17(5-2)11-10-16-12-15(3)18-13-8-6-7-9-14(13)19-15/h6-9,16H,4-5,10-12H2,1-3H3
charge 0 multiplicity 1
43 atoms
O  -1.91256 0.439241 -1.048786
O  -2.626645 1.268209 1.096308
N  0.849653 0.543037 -0.169198
N  4.528878 -0.402257 -0.127187
C  -1.482118 1.310369 0.118697
C  -0.269084 0.632521 0.781178
C  2.128089 0.081401 0.412212
C  3.24456 0.125251 -0.65087
C  -1.272851 2.731567 -0.368739
C  -3.091752 -0.218588 -0.628563
C  -3.510602 0.267493 0.630861
C  5.71982 0.280799 -0.700383
C  4.613277 -1.886189 -0.20828
C  -3.814318 -1.193516 -1.321388
C  -4.671268 -0.198817 1.253627
C  5.93801 1.691026 -0.119857
C  5.565491 -2.494857 0.83905
C  -4.996218 -1.684235 -0.696734
C  -5.415344 -1.197441 0.562937
H  -0.609999 -0.35274 1.183822
H  0.041012 1.249193 1.645743
H  2.063251 -0.946805 0.847306
H  2.407679 0.757533 1.241441
H  2.911669 -0.431931 -1.565036
H  3.37655 1.176556 -0.959827
H  0.579066 -0.002453 -0.999986
H  -0.383841 2.764575 -1.018946
H  -1.104676 3.396551 0.49576
H  -2.159686 3.079528 -0.922006
H  5.662299 0.335257 -1.817806
H  6.606526 -0.335202 -0.464056
H  4.913788 -2.221872 -1.234307
H  3.598324 -2.289803 -0.034116
H  -3.485457 -1.557397 -2.29851
H  -4.988726 0.188531 2.225359
H  6.846872 2.150949 -0.551397
H  6.054067 1.634566 0.976449
H  5.087884 2.362721 -0.337755
H  5.566302 -3.598654 0.766182
H  5.244562 -2.205103 1.854721
H  6.606561 -2.150915 0.701053
H  -5.587754 -2.452185 -1.205872
H  -6.328488 -1.591913 1.020595
