program: Gaussian 09
title: 000005707
version: EM64L-G09RevD.01
frameworkgroup: C1[X(C12H16N2S)]
method: RPBEPBE
basis: SDD
operation: Freq
keyword: #p
keyword: freq=noraman
keyword: PBEPBE/SDD
title: #p freq=noraman PBEPBE/SDD
converged: YES YES NO NO
title: Mulliken charges:
elementType: S N N C C C C C C C C C C C C H H H H H H H H H H H H H H H H
charge: 0.107323 -0.451091 0.016075 -0.355318 0.124313 -0.654338 -0.443472 0.341949 0.369513 -0.140954 -0.423065 -0.419292 -0.837402 -0.823422 -0.234307 0.210170 0.235873 0.264362 0.263040 0.207739 0.227399 0.310778 0.230436 0.230031 0.249063 0.223104 0.232617 0.227789 0.213358 0.274751 0.222978
chargesum: 0.00000
title: Mulliken charges with hydrogens summed into heavy atoms:
elementType: S N N C C C C C C C C C C C C
charge: 0.107323 -0.140313 0.016075 0.090725 0.124313 -0.126936 -0.008334 0.341949 0.369513 -0.140954 -0.192629 -0.189261 -0.132618 -0.107524 -0.011329
polarizability: 2.17807111e+02 -2.04205014e+00 1.59234461e+02 9.85582965e+00 -3.97795174e+00 1.09267637e+02
1716.lowfreq: -15.5805 -5.8309 0.0012 0.0021 0.0022 2.3098 33.6980 38.6861 47.1668
frequency: 33.2151 38.6189 46.9605 70.1388 136.0896 155.3939 165.3464 184.0415 212.9032 227.7470 262.7251 289.2537 313.3227 322.5446 361.4961 407.5798 447.0811 486.4134 504.7527 512.5603 515.5390 537.4352 567.0289 579.8119 618.6296 673.7162 699.8667 766.3959 777.6237 808.4899 844.9892 872.9315 896.0007 901.6454 927.0174 971.6309 978.4627 987.2622 1036.5648 1039.2528 1043.9398 1050.8428 1069.0029 1096.4445 1153.9789 1162.1793 1176.3929 1195.6006 1243.2908 1259.5218 1264.7308 1285.2768 1290.5436 1339.8716 1352.8463 1366.7877 1391.0473 1398.4244 1436.4291 1442.2796 1445.4752 1449.7113 1453.4696 1468.8267 1469.7493 1478.8601 1486.5143 1494.5429 1602.5844 1605.1534 1689.2744 2953.9221 2962.0418 2975.9113 2987.7615 3025.0676 3027.5058 3041.4567 3055.7614 3056.8888 3087.0086 3088.4880 3103.4450 3118.8871 3128.8662 3154.7465 3519.6813
redmass: 2.8417 6.5379 3.4334 3.9001 2.5273 1.1933 1.0639 3.6426 4.9222 2.8252 3.8377 2.0567 2.6443 3.0207 5.9871 3.5481 1.6233 2.2015 4.7190 4.1137 3.1655 5.6692 3.4135 4.5662 5.1094 5.2355 3.7733 3.8107 1.2762 4.6773 1.5023 2.7112 1.3127 2.8160 2.3782 1.3920 2.6891 1.5887 1.5786 1.7045 1.6707 1.5686 2.1299 1.7500 1.2609 2.3593 1.1693 1.7711 2.6956 1.6360 1.3760 2.4219 1.2285 1.3494 1.3193 6.2971 1.2394 1.2586 1.9504 1.0856 1.0959 1.3084 1.4895 1.1056 1.1188 1.3043 1.2587 1.4519 6.0323 6.1003 7.6964 1.0675 1.0422 1.0360 1.0616 1.0825 1.0713 1.0918 1.0987 1.0965 1.0999 1.0985 1.1079 1.0855 1.0919 1.0994 1.0757
irintensity: 2.9433 0.0302 0.6066 0.1711 2.0110 0.6902 1.1411 3.1919 4.1205 0.6922 5.4677 1.4304 2.7248 10.9616 11.1447 3.9853 54.2371 46.3877 13.2837 12.6874 3.2704 1.6501 9.6007 4.9651 2.7542 23.0022 11.4222 2.9026 52.3119 23.5823 5.3979 10.6634 0.7127 30.7738 16.3234 8.8537 111.7626 0.3459 8.9593 7.1319 7.8613 10.9976 6.7461 34.2774 2.0537 6.5333 1.9235 1.2160 72.7068 2.0702 10.2283 43.2423 27.8284 18.1430 28.7590 22.9435 22.1735 10.4743 2.1379 16.0855 4.4834 51.3579 26.1993 9.1972 18.5713 133.6000 63.1636 73.4081 9.1570 3.2870 276.1298 58.9610 33.5479 28.7620 31.0857 40.8850 30.9600 19.7159 38.6770 10.1968 23.1663 23.4981 16.3363 0.3301 28.0013 38.1684 25.2931
temp: 298.150 k
press: 1.00000 atm
elementType: 16 7 7 6 6 6 6 6 6 6 6 6 6 6 6 1 1 1 1 1 1 1 1 1 1 1 1 1 1 1 1
symmnumber: 1
zpe: 670683.4 jmol-1
zpe.correction: 0.255450 hartree
zpe.thermalcorrener: 0.270723 hartree
zpe.thermalcorrenthalpy: 0.271667 hartree
zpe.thermalcorrgfe: 0.212081 hartree
zpe.sumelectzpe: -973.322626 hartree
zpe.sumelectthermal: -973.307352 hartree
zpe.sumelectthermalent: -973.306408 hartree
zpe.sumelectthermalfe: -973.365994 hartree
dipole: -1.6740 0.2027 0.4076
dipole: 1.7348
quadrupole: -83.5594 -91.9731 -99.8015
quadrupole: 4.8882 -2.5004 1.1657
quadrupole: 8.2186 -0.1951 -8.0235 4.8882 -2.5004 1.1657
hfenergy: -973.5780756 hartree
pointgroup: C01 [X(C12H16N2S1)]
dipole: 0.6686504 -0.1133737 0.076606 debye
polarizability: 216.4750383|8.3113883|142.9469384|-13.4562297|23.1656299|126.8872329 unknown
InChI: InChI=1S/C12H16N2S/c1-9-5-3-6-10(2)11(9)14-12-13-7-4-8-15-12/h3,5-6,14H,4,7-8H2,1-2H3
charge 0 multiplicity 1
31 atoms
S  2.798406 -0.366444 -1.547422
N  0.164893 -0.180064 -1.001386
N  1.473762 0.415519 0.886087
C  3.961827 -0.159189 1.040584
C  -1.144303 -0.141429 -0.402373
C  4.242286 0.166845 -0.434277
C  2.748169 0.620311 1.596681
C  -1.925017 -1.336423 -0.438703
C  -1.664572 1.068513 0.141444
C  1.378523 0.030393 -0.342352
C  -3.234161 -1.309618 0.096521
C  -2.973676 1.045907 0.684374
C  -1.358021 -2.615315 -1.031211
C  -0.866717 2.353886 0.1218
C  -3.756205 -0.127874 0.666216
H  4.854596 0.106764 1.640395
H  3.796161 -1.247101 1.153122
H  5.110859 -0.389532 -0.821639
H  4.405309 1.246877 -0.587188
H  2.981352 1.706765 1.601728
H  2.581135 0.334281 2.651881
H  0.234797 -0.634814 -1.91493
H  -3.838621 -2.224169 0.076351
H  -3.38379 1.969805 1.109189
H  -0.367711 -2.854008 -0.601515
H  -1.227372 -2.5479 -2.130691
H  -2.031563 -3.467128 -0.838432
H  -0.377899 2.503406 -0.858665
H  -1.510563 3.224636 0.333897
H  -0.056953 2.308875 0.873279
H  -4.768529 -0.120575 1.085434
