program: Gaussian 09
title: 000040395
version: EM64L-G09RevD.01
frameworkgroup: C1[X(C21H30N2O2)]
method: RPBEPBE
basis: SDD
operation: Freq
keyword: #p
keyword: freq=noraman
keyword: PBEPBE/SDD
title: #p freq=noraman PBEPBE/SDD
converged: YES YES NO NO
title: Mulliken charges:
elementType: O O N N C C C C C C C C C C C C C C C C C C C C C H H H H H H H H H H H H H H H H H H H H H H H H H H H H H H
charge: -0.275768 -0.277293 -0.278685 -0.085500 0.283476 -0.386657 -0.381505 -0.367875 -0.692320 0.203169 0.196340 -0.358807 -0.376803 -0.576531 -0.577654 0.415037 0.415370 -0.312963 -0.385935 -0.420988 -0.421492 -0.700685 -0.688881 -0.249398 -0.249660 0.207281 0.204972 0.205614 0.241954 0.207515 0.172986 0.228485 0.229520 0.242907 0.220465 0.180423 0.237519 0.169289 0.228499 0.257058 0.256415 0.179898 0.205855 0.217707 0.216513 0.238408 0.237814 0.228821 0.214516 0.209851 0.215016 0.218447 0.226223 0.226074 0.225964
chargesum: 0.00000
title: Mulliken charges with hydrogens summed into heavy atoms:
elementType: O O N N C C C C C C C C C C C C C C C C C C C C C
charge: -0.275768 -0.277293 -0.041166 -0.085500 0.283476 0.025596 0.066062 0.012626 0.008591 0.203169 0.196340 0.042080 0.020985 -0.319473 -0.321239 0.415037 0.415370 0.072791 0.048285 -0.182579 -0.183677 -0.047497 -0.029195 -0.023324 -0.023696
polarizability: 2.69951972e+02 -6.63863420e+01 2.93319307e+02 -2.00573146e-01 -4.68448196e-01 2.17629215e+02
1716.lowfreq: -4.3251 -0.0007 -0.0005 0.0006 5.0417 8.4830 10.2693 21.2901 23.9083
frequency: 10.1246 21.1493 23.3466 40.5096 48.4956 61.6677 75.2125 89.0851 90.9300 106.6773 124.6336 137.9754 142.7125 153.0509 171.5464 190.7555 195.3525 207.0402 224.1686 239.8256 245.5840 270.9315 293.9311 304.3469 327.7527 328.0294 357.4921 370.5438 393.6867 400.0071 420.7735 445.1048 453.1936 479.3860 500.4694 527.5723 554.1267 563.4159 565.4111 606.2515 639.9829 676.5763 679.2312 722.1374 724.7724 730.7332 745.4302 749.4144 754.5527 771.0681 772.8015 772.9556 796.3077 808.1649 840.0535 852.9852 867.0315 869.8106 892.0294 895.4108 899.9888 932.6256 956.0036 969.6273 983.3770 1011.7355 1016.3640 1019.3050 1026.7127 1035.9235 1049.2341 1062.5430 1072.9520 1080.7967 1085.7438 1086.9680 1110.5519 1127.1623 1140.1511 1146.5126 1148.7499 1163.6224 1173.3315 1173.4291 1204.2476 1206.7749 1223.3949 1230.3646 1239.6543 1259.7235 1262.1504 1270.6809 1276.8483 1277.6825 1289.9457 1292.7298 1311.7051 1331.0685 1332.1009 1341.4103 1355.6046 1368.6619 1373.1113 1379.3185 1384.2152 1390.5650 1395.2518 1403.0634 1432.9281 1442.9813 1445.9332 1449.3565 1456.3880 1459.8755 1462.5938 1466.5243 1467.2999 1468.8409 1475.3716 1476.9454 1481.5054 1484.9523 1490.0894 1496.8143 1498.7682 1520.9853 1616.6988 1619.8516 1641.0963 2831.6844 2841.6561 2852.0393 2863.3364 2977.2932 2983.6499 2983.8784 2989.4186 2991.5951 2998.0570 3002.3962 3016.6421 3023.6962 3039.4022 3041.5446 3048.0142 3071.8356 3073.5761 3076.7810 3080.8782 3088.3488 3107.2822 3108.6409 3118.9015 3124.2493 3141.5514 3161.4461 3163.1466 3165.8928 3418.3995
redmass: 5.5888 3.2988 3.7260 3.7406 3.9825 2.6457 1.8928 2.7103 3.5518 4.0362 3.2727 1.9568 3.3296 2.4813 1.8035 2.5884 1.2548 2.3884 1.0977 3.2925 3.2816 2.0655 1.8543 4.0279 4.4505 4.5198 3.9900 3.5508 3.2158 2.6505 3.6749 3.7004 3.3588 2.7471 2.8020 2.9814 3.7494 3.8320 5.1445 6.0991 4.3660 1.4162 5.6494 5.6611 6.6138 2.6789 2.8890 5.9527 1.2400 2.6017 1.4919 1.1478 1.1757 1.1770 1.2968 3.7707 1.3511 1.4269 1.7821 1.9661 5.5873 1.7734 1.4014 2.5215 1.3295 1.8051 2.9412 3.4460 2.2796 2.1110 2.4081 2.1140 2.1955 2.1550 2.1416 2.6954 1.6157 1.7848 1.4724 3.2235 3.7132 1.4487 1.7771 1.1438 1.9369 1.8030 1.5366 2.6208 1.5076 4.9543 2.1269 1.1994 1.1835 1.2678 1.2115 1.1261 1.3572 1.8498 1.3291 1.2367 1.4350 1.4490 1.3891 1.2814 1.2591 1.2472 1.4734 7.0235 2.3379 1.0813 2.9639 1.2193 1.0657 1.0954 1.0479 4.5253 1.0631 1.0627 1.0738 1.0548 1.0547 1.0767 1.0835 1.0850 1.0777 4.4778 6.3159 9.1950 8.0800 1.0718 1.0716 1.0712 1.0706 1.0350 1.0367 1.0762 1.0638 1.0606 1.0663 1.0370 1.0860 1.0853 1.1003 1.0987 1.0918 1.0988 1.1016 1.0989 1.1007 1.1005 1.1000 1.1006 1.0855 1.0890 1.0945 1.1002 1.0930 1.0933 1.0737
irintensity: 0.0228 0.1736 0.0913 0.6962 0.0519 0.6984 1.2811 0.5949 0.0182 0.3888 0.3318 5.1617 0.1602 1.6202 1.0772 0.8424 0.7866 1.6627 0.0963 1.4633 0.0951 0.3804 1.9273 0.6471 4.4150 0.7718 0.1110 1.0325 1.7152 3.8963 1.2678 0.6129 6.6136 23.3093 13.3332 1.6339 0.0817 11.2927 0.6588 5.8449 4.3455 68.4717 0.6776 1.9323 29.6674 3.8432 6.8046 4.1632 51.2724 1.1409 23.8091 4.1309 3.7726 6.1797 0.0038 112.8398 4.8503 90.9066 0.0040 2.2788 0.3214 20.4947 10.3682 14.4846 0.0003 5.7338 4.3077 3.6779 5.9636 35.9804 12.4303 6.1542 7.5573 17.8246 70.6487 31.8650 6.2004 5.4395 9.5874 77.9235 66.5756 116.2804 16.1594 12.3689 12.1997 19.3082 2.8996 231.5323 30.3685 217.3622 3.2336 4.5089 7.3491 3.5578 23.6715 1.8024 41.7592 0.0133 1.3573 5.9921 12.3509 10.8299 4.7840 20.5098 26.4419 28.6220 7.6236 0.9032 31.7251 4.0642 4.1397 45.0221 12.0596 9.5577 10.2452 268.2449 14.6579 9.0282 9.5944 5.2576 10.3371 3.4524 17.6299 5.8350 1.7270 9.8928 0.2509 8.5960 0.5255 96.4796 47.0052 154.5440 130.9231 27.6159 29.2509 4.8719 10.3447 46.4254 55.2284 23.2072 19.5355 19.3820 12.8009 3.1759 37.6960 46.8879 28.8085 68.8512 51.9296 44.0848 13.2631 25.5848 5.5037 0.4789 32.5468 41.7098 6.0340 0.5199 2.0180
temp: 298.150 k
press: 1.00000 atm
elementType: 8 8 7 7 6 6 6 6 6 6 6 6 6 6 6 6 6 6 6 6 6 6 6 6 6 1 1 1 1 1 1 1 1 1 1 1 1 1 1 1 1 1 1 1 1 1 1 1 1 1 1 1 1 1 1
symmnumber: 1
zpe: 1231785.4 jmol-1
zpe.correction: 0.469162 hartree
zpe.thermalcorrener: 0.495126 hartree
zpe.thermalcorrenthalpy: 0.496070 hartree
zpe.thermalcorrgfe: 0.410112 hartree
zpe.sumelectzpe: -1076.253563 hartree
zpe.sumelectthermal: -1076.227600 hartree
zpe.sumelectthermalent: -1076.226655 hartree
zpe.sumelectthermalfe: -1076.312614 hartree
dipole: -0.8257 0.8762 0.9748
dipole: 1.5491
quadrupole: -152.1726 -139.8953 -146.4501
quadrupole: 1.8798 -3.3232 -0.0614
quadrupole: -5.9999 6.2774 -0.2774 1.8798 -3.3232 -0.0614
hfenergy: -1076.7227257 hartree
pointgroup: C01 [X(C21H30N2O2)]
dipole: -0.3267498 0.3476871 0.3791914 debye
polarizability: 271.1917258|-66.5918098|292.0513212|0.6739928|-1.4200402|217.6574467 unknown
InChI: InChI=1S/C21H30N2O2/c1-4-23(5-2)14-13-22-12-8-11-21(3)24-19-15-17-9-6-7-10-18(17)16-20(19)25-21/h6-7,9-10,15-16,22H,4-5,8,11-14H2,1-3H3
charge 0 multiplicity 1
55 atoms
O  2.223061 1.848531 -1.28315
O  2.156814 1.9641 1.115991
N  -2.794597 0.595922 -0.138502
N  -6.404013 -0.59199 -0.155525
C  1.79473 2.732675 -0.134851
C  0.27695 2.92659 -0.182388
C  -0.529221 1.612761 -0.162698
C  -2.048661 1.870179 -0.157124
C  2.622161 4.014568 -0.173691
C  2.945497 0.775779 -0.72511
C  2.907813 0.84551 0.703654
C  -4.266871 0.728241 -0.147132
C  -4.925377 -0.66548 -0.237576
C  3.602818 -0.238748 -1.394145
C  3.527068 -0.096042 1.502833
C  4.26523 -1.247268 -0.602923
C  4.227709 -1.175596 0.850237
C  -6.902236 -0.525885 1.241404
C  -7.106169 -1.562694 -1.03243
C  4.969501 -2.330492 -1.22111
C  4.896648 -2.190349 1.607793
C  -8.371255 -0.075072 1.346486
C  -6.966271 -3.064226 -0.654877
C  5.612625 -3.30664 -0.452724
C  5.576072 -3.235955 0.973686
H  0.043164 3.504223 -1.098136
H  -0.00151 3.561548 0.681757
H  -0.250142 1.030647 0.738104
H  -0.273638 0.997246 -1.043313
H  -2.336044 2.419771 -1.076602
H  -2.307441 2.538975 0.705917
H  2.367287 4.655897 0.687214
H  2.419398 4.567923 -1.106477
H  3.697813 3.775304 -0.130946
H  -4.564752 1.315648 -1.035577
H  -4.663381 1.277655 0.743855
H  -2.475791 -0.011799 0.630544
H  -4.492087 -1.326199 0.557563
H  -4.635011 -1.114178 -1.204751
H  3.622621 -0.28486 -2.48654
H  3.491307 -0.033386 2.59407
H  -6.773241 -1.499786 1.780561
H  -6.271804 0.208191 1.777747
H  -8.178174 -1.292588 -1.060198
H  -6.724278 -1.410851 -2.060133
H  4.997321 -2.384817 -2.316054
H  4.868567 -2.135616 2.702728
H  -8.515257 0.87983 0.810561
H  -9.06735 -0.819184 0.919011
H  -8.650645 0.069283 2.406532
H  -7.498133 -3.6935 -1.392893
H  -7.396935 -3.277736 0.340509
H  -5.906109 -3.377681 -0.644227
H  6.145967 -4.128588 -0.942762
H  6.081951 -4.003895 1.569106
