program: Gaussian 09
title: 000040264
version: EM64L-G09RevD.01
frameworkgroup: C1[X(C20H16)]
method: RPBEPBE
basis: SDD
operation: Freq
keyword: #p
keyword: freq=noraman
keyword: PBEPBE/SDD
title: #p freq=noraman PBEPBE/SDD
converged: YES YES NO NO
title: Mulliken charges:
elementType: C C C C C C C C C C C C C C C C C C C C H H H H H H H H H H H H H H H H
charge: 0.148480 0.213897 0.194352 0.271642 0.446844 0.188852 -0.782223 0.436083 -0.417983 0.298304 -0.548719 -0.370235 -0.920234 -0.341078 -0.462637 -0.264350 -0.456487 -0.836937 -0.289060 -0.256157 0.240511 0.219862 0.236413 0.220548 0.252309 0.235148 0.234954 0.246089 0.233756 0.224746 0.243096 0.239583 0.232706 0.232715 0.224633 0.230577
chargesum: 0.00000
title: Mulliken charges with hydrogens summed into heavy atoms:
elementType: C C C C C C C C C C C C C C C C C C C C
charge: 0.148480 0.213897 0.194352 0.271642 0.446844 0.188852 -0.541711 0.436083 -0.198121 0.298304 -0.312306 -0.149687 -0.197824 -0.094989 -0.228881 -0.039605 -0.213391 -0.131933 -0.064426 -0.025579
polarizability: 3.95447769e+02 1.14268089e+01 2.36728999e+02 -1.65801461e-02 -1.17296308e-02 9.05318931e+01
1716.lowfreq: -38.2286 -6.2218 -0.0003 0.0005 0.0009 2.1555 7.3266 50.4558 74.2047
frequency: -38.1617 50.4462 74.1983 149.6272 175.7205 187.1337 201.3022 203.1301 273.7269 291.4494 291.9005 322.9099 335.5100 359.8585 415.0665 420.6093 426.1482 488.2075 499.1428 504.4307 530.7565 540.2750 551.6031 557.0615 582.2847 585.9076 617.6554 666.6972 705.9035 712.3294 751.9979 756.5073 797.5039 805.4994 818.6108 845.8402 859.8078 870.5544 885.3907 893.2693 913.1523 917.8141 954.4999 973.4846 981.7050 983.1805 991.7145 1003.2476 1029.3688 1046.8897 1049.8685 1052.7569 1093.5399 1096.9038 1141.9337 1173.7110 1181.8372 1199.3397 1232.5308 1244.7833 1257.9608 1271.1763 1281.1366 1293.8770 1320.6912 1367.4943 1384.5774 1398.8574 1401.2530 1403.3976 1416.8207 1423.7123 1445.0507 1453.4421 1466.3189 1473.5948 1484.1077 1489.4598 1501.0880 1528.7741 1533.9123 1576.3503 1605.4968 1614.0948 1621.3017 1630.7474 2972.5545 2973.3159 3047.2077 3057.2176 3073.5278 3084.3727 3120.3936 3122.7961 3126.8550 3133.7504 3139.2863 3144.0535 3159.1569 3167.9831 3182.2830 3266.8845
redmass: 3.2629 3.7297 3.9185 3.5907 4.2450 1.9377 3.7111 1.3611 4.8150 4.0909 3.7454 2.8246 3.3822 1.4602 2.3050 4.9762 3.7934 2.9082 5.6208 3.6889 6.1750 2.8551 4.3975 6.3437 3.4572 5.0315 2.7349 6.0050 5.6885 3.5191 1.5496 1.2595 2.0880 5.6367 1.4670 5.3728 3.9683 1.8688 1.8808 1.5315 4.6707 2.0147 1.3835 1.4092 1.3617 3.0422 1.3773 1.9613 1.8484 1.5606 2.1910 1.6287 2.3968 2.1271 1.7477 1.2449 1.1617 1.5839 2.3206 1.8863 1.7070 2.3933 1.8120 1.9160 3.8266 3.7610 2.8710 1.5129 2.5496 1.3924 3.1625 2.4131 2.2339 2.5660 2.9727 1.0461 1.2004 1.0490 1.2532 2.9253 4.1710 7.4835 5.7121 6.1762 5.9621 6.9580 1.0377 1.0373 1.0973 1.0986 1.0976 1.0980 1.0870 1.0871 1.0892 1.0908 1.0898 1.0926 1.0996 1.0969 1.0909 1.0887
irintensity: 0.0047 0.1012 0.4892 1.3930 0.6274 2.5033 3.6467 0.0498 0.0855 0.3517 1.7808 0.0047 1.7706 7.0083 1.0935 1.0058 0.2511 2.5548 0.5830 0.0024 7.9040 0.2932 0.1099 4.0276 0.0201 3.2172 10.9264 3.5608 0.4272 10.8647 30.3851 7.5854 74.5268 2.6611 44.7794 6.5013 0.0153 0.5079 4.8897 19.6006 0.4043 4.5798 1.4610 2.0160 0.0591 3.0451 0.7911 2.2981 9.2188 8.5561 4.3652 4.8745 8.6260 1.2584 1.9945 0.1214 3.3456 0.5853 4.3472 12.5191 0.3422 0.8794 7.8802 7.3329 0.2915 2.9907 0.0104 8.7261 6.2848 9.2986 5.3052 1.5537 25.4811 1.2471 7.3945 15.6207 27.9835 11.5571 16.2459 0.8880 1.5792 1.7770 16.0158 0.9960 1.4556 1.5473 32.7688 38.4296 19.6805 15.5002 27.7949 23.8201 1.3076 9.0537 10.8996 22.3305 17.1056 32.3123 44.3399 6.5088 34.4928 8.9191
temp: 298.150 k
press: 1.00000 atm
elementType: 6 6 6 6 6 6 6 6 6 6 6 6 6 6 6 6 6 6 6 6 1 1 1 1 1 1 1 1 1 1 1 1 1 1 1 1
symmnumber: 1
zpe: 769704.6 jmol-1
zpe.correction: 0.293165 hartree
zpe.thermalcorrener: 0.307654 hartree
zpe.thermalcorrenthalpy: 0.308599 hartree
zpe.thermalcorrgfe: 0.252654 hartree
zpe.sumelectzpe: -770.413573 hartree
zpe.sumelectthermal: -770.399083 hartree
zpe.sumelectthermalent: -770.398139 hartree
zpe.sumelectthermalfe: -770.454083 hartree
dipole: -0.2186 0.7114 -0.0006
dipole: 0.7442
quadrupole: -100.6741 -100.3305 -125.3015
quadrupole: -1.2526 -0.0023 -0.0022
quadrupole: 8.0946 8.4382 -16.5328 -1.2526 -0.0023 -0.0022
hfenergy: -770.7067379 hartree
pointgroup: C01 [X(C20H16)]
dipole: 0.0819583 0.2810739 0.0002187 debye
polarizability: 395.7432661|-9.1424157|236.4335019|-0.0167469|0.0114903|90.5318931 unknown
InChI: InChI=1S/C20H16/c1-13-6-5-9-17-18-11-10-15-7-3-4-8-16(15)20(18)14(2)12-19(13)17/h3-12H,1-2H3
charge 0 multiplicity 1
36 atoms
C  -0.620103 0.411096 -0.00046
C  0.176291 -0.798639 -0.000518
C  1.639532 -0.765061 -0.000319
C  2.308547 0.508731 -0.00034
C  0.102053 1.687465 -0.000867
C  -2.093511 0.278467 0.000083
C  1.497023 1.68791 -0.000693
C  -2.690642 -1.0453 -0.000398
C  -0.47829 -2.083143 -0.000781
C  3.750444 0.592068 -0.000191
C  -1.850734 -2.208101 -0.000908
C  2.449057 -1.947982 0.000003
C  -0.53275 3.073141 -0.001592
C  -3.025958 1.37239 0.001366
C  4.493454 -0.595866 0.000269
C  3.843891 -1.863599 0.0004
C  -4.110095 -1.218809 -0.000157
C  4.460483 1.934664 -0.000254
C  -4.414966 1.182748 0.00165
C  -4.975364 -0.123489 0.000746
H  2.004175 2.658106 -0.000976
H  0.125193 -2.992806 -0.000924
H  -2.320283 -3.198622 -0.001187
H  1.993216 -2.940768 0.00015
H  0.261177 3.838992 -0.002109
H  -1.155305 3.253813 -0.897087
H  -1.15518 3.254843 0.893819
H  -2.678196 2.399253 0.00239
H  5.588742 -0.548905 0.000597
H  4.44487 -2.779726 0.000821
H  -4.506931 -2.241069 -0.000606
H  5.554544 1.795107 0.000108
H  4.199822 2.537955 -0.890808
H  4.199332 2.538482 0.889807
H  -5.07283 2.059219 0.002614
H  -6.061408 -0.264365 0.00095
