program: Gaussian 09
title: 000005774
version: EM64L-G09RevD.01
frameworkgroup: C1[X(C19H18N3O4S2)]
method: RPBEPBE
basis: SDD
operation: Freq
keyword: #p
keyword: freq=noraman
keyword: PBEPBE/SDD
title: #p freq=noraman PBEPBE/SDD
converged: YES YES NO NO
title: Mulliken charges:
elementType: S S O O O O N N N C C C C C C C C C C C C C C C C C C C H H H H H H H H H H H H H H H H H H
charge: 0.277101 0.273983 -0.110907 -0.379818 -0.236685 -0.251286 -0.165054 -0.383620 -0.065464 -0.494581 -0.170917 0.129307 0.159871 0.348021 -0.826956 -0.571449 0.132735 0.251154 -0.588937 -0.108353 -0.077890 -0.127297 -0.182643 -0.192543 -0.136260 -0.274073 -0.124688 -0.500765 0.337339 0.324301 0.288690 0.269810 0.362156 0.358266 0.254525 0.271323 0.275506 0.286101 0.303670 0.414919 0.283535 0.283014 0.292555 0.263581 0.253889 0.274838
chargesum: 1.00000
title: Mulliken charges with hydrogens summed into heavy atoms:
elementType: S S O O O O N N N C C C C C C C C C C C C C C C C C C C
charge: 0.277101 0.273983 -0.110907 0.035101 -0.236685 -0.251286 -0.165054 -0.021465 -0.065464 -0.157242 0.153384 0.129307 0.159871 0.348021 -0.268457 0.041341 0.132735 0.251154 -0.042108 0.177748 0.225780 -0.127297 0.100892 0.090471 0.156296 -0.010492 0.129200 -0.225928
polarizability: 3.70977039e+02 -4.69007981e+01 2.48039302e+02 -3.58463498e+00 1.20240753e+01 2.33277070e+02
1716.lowfreq: -3.9420 -0.7457 -0.0007 0.0015 0.0017 4.9147 10.9669 18.3805 21.4359
frequency: 9.9626 17.5562 21.4028 26.1303 30.0126 33.8363 44.9054 52.7897 60.9863 78.9448 83.6807 120.8345 127.6800 152.4590 176.5241 177.4920 202.6938 213.8837 250.4514 262.4430 279.0897 281.1857 318.7434 340.7939 362.5932 386.3119 397.0470 414.8606 430.3095 449.5039 458.3233 474.1765 516.7241 537.1301 549.4475 557.1461 567.3904 591.4460 596.7133 610.7088 624.4237 639.1581 642.2631 661.7574 663.4952 680.0884 689.2744 707.9460 710.1844 728.2678 734.6955 746.8716 761.6596 783.7562 794.3853 821.8858 840.2278 858.0877 869.5150 877.3234 908.5203 918.3353 920.3178 934.3544 955.0144 963.4790 978.2749 992.2497 1009.3025 1012.8122 1024.7819 1039.9471 1050.4113 1051.1513 1082.3317 1082.7773 1095.7692 1104.3725 1129.5872 1145.1013 1174.7198 1179.6894 1184.5755 1199.0176 1203.6133 1215.8995 1217.9763 1233.7256 1236.5324 1242.9527 1247.8467 1269.2815 1288.9189 1294.3972 1320.9745 1334.0330 1342.9860 1353.8817 1375.0313 1392.4873 1426.8193 1432.2111 1460.6693 1461.6016 1470.5487 1476.0757 1488.9379 1550.8056 1571.4018 1596.1605 1616.8661 1618.4757 1622.6050 1752.3602 2998.1001 3000.4123 3001.1469 3006.8902 3065.1236 3066.2928 3071.6447 3079.2875 3163.0259 3176.3206 3181.7351 3187.8134 3188.6555 3198.7677 3206.2702 3240.5440 3498.4053 3520.8057
redmass: 6.9325 7.3066 5.6396 5.6798 4.8353 6.2526 7.6321 10.4179 5.4084 9.4398 7.5410 5.3343 5.1660 7.4014 5.7289 5.0730 6.8093 5.9160 7.4481 4.7545 2.5461 7.5455 5.0469 6.2594 3.1476 7.7132 2.7063 4.9214 6.0161 3.6768 5.5126 4.3360 4.6857 3.2232 4.3274 3.8932 3.7204 7.5189 3.4953 4.9211 2.1992 1.3361 5.1030 3.6846 3.5291 6.1113 2.1137 2.1265 1.8463 6.5731 5.1622 6.2471 2.0612 7.6455 2.6100 4.0478 1.3926 1.9221 1.2935 3.6510 1.6581 1.8933 3.6668 3.8032 1.5561 3.1210 2.4860 1.4074 6.4462 5.4869 1.3667 1.6738 2.8226 3.3439 1.2849 1.9164 2.8148 2.0560 1.7398 1.4040 1.8598 1.6829 1.0854 1.5163 1.4857 1.6208 1.4228 1.5869 1.2301 1.2900 1.4138 2.2792 1.8838 1.4653 1.4215 1.7584 2.2105 1.5606 2.2282 5.0711 1.1065 1.1157 1.9125 1.3334 2.2089 6.5152 1.4758 5.9892 5.9819 7.2986 8.9009 7.7767 5.2063 12.8591 1.0608 1.0752 1.0674 1.0624 1.0979 1.1053 1.1005 1.0896 1.0922 1.0903 1.0912 1.0958 1.0947 1.0985 1.1032 1.1005 1.0783 1.0649
irintensity: 0.8116 0.6250 0.2809 0.2278 0.0107 0.1946 1.3674 1.2704 5.8646 2.0313 0.7778 1.1631 8.6271 2.7374 1.5726 1.0415 7.9756 2.2345 0.9434 13.5183 2.5211 3.1625 4.8598 0.8866 5.1235 21.0881 0.6419 3.0297 3.7375 13.8515 14.0942 9.6974 4.3826 49.7786 1.1965 1.5757 10.4965 0.9659 5.5117 7.3817 66.9496 30.9556 2.7688 38.4479 65.4709 6.6147 53.1741 58.5962 59.5511 10.5181 11.0693 17.4622 46.2720 3.1274 31.1443 6.1432 11.9210 16.0382 0.5957 37.0080 5.1169 0.3321 23.4633 101.0030 6.0592 7.0710 79.8368 5.9303 237.9680 8.8022 0.1890 8.6913 37.1002 124.3485 8.0331 83.9459 79.0745 22.4971 8.4053 4.0957 25.4075 10.9977 2.2255 12.3910 49.3158 13.7887 20.4758 28.2056 9.7818 20.3076 10.0637 7.3041 160.3724 1.2295 88.9701 7.6462 0.2937 2.3531 17.9126 226.0527 14.9470 96.9956 316.3180 27.8581 38.9713 8.7337 43.9371 2.7189 9.8195 154.7845 204.5695 212.9224 3.4389 379.8757 3.7463 141.9397 50.6423 5.6785 0.2875 37.0991 2.9425 8.9252 4.3257 0.6020 1.7295 2.3434 1.8256 2.1249 0.1827 0.8224 83.0242 114.8372
temp: 298.150 k
press: 1.00000 atm
elementType: 16 16 8 8 8 8 7 7 7 6 6 6 6 6 6 6 6 6 6 6 6 6 6 6 6 6 6 6 1 1 1 1 1 1 1 1 1 1 1 1 1 1 1 1 1 1
symmnumber: 1
zpe: 898418.2 jmol-1
zpe.correction: 0.342189 hartree
zpe.thermalcorrener: 0.368144 hartree
zpe.thermalcorrenthalpy: 0.369089 hartree
zpe.thermalcorrgfe: 0.280087 hartree
zpe.sumelectzpe: -1993.820954 hartree
zpe.sumelectthermal: -1993.794999 hartree
zpe.sumelectthermalent: -1993.794055 hartree
zpe.sumelectthermalfe: -1993.883056 hartree
dipole: 21.8870 -5.6356 -1.1667
dipole: 22.6310
quadrupole: -24.2862 -153.4394 -170.5913
quadrupole: -15.8423 15.9455 7.3332
quadrupole: 91.8195 -37.3337 -54.4857 -15.8423 15.9455 7.3332
hfenergy: -1994.1631436 hartree
pointgroup: C01 [X(C19H18N3O4S2)]
dipole: -8.2825838 -3.2104079 -0.6068177 debye
polarizability: 357.9736663|57.7954002|265.5343601|17.294531|-1.5269682|228.7853837 unknown
InChI: InChI=1S/C19H18N3O4S2/c23-14(9-13-5-4-8-27-13)20-15-17(24)22-16(19(25)26)12(11-28-18(15)22)10-21-6-2-1-3-7-21/h1-8,15,18,20,25H,9-11H2
charge 1 multiplicity 1
46 atoms
S  0.488281 -1.315945 -0.956768
S  5.939398 0.546363 1.452972
O  1.169481 2.426287 1.457073
O  -1.722392 2.949128 1.378931
O  -2.751772 1.285173 2.626739
O  3.787768 1.887554 -2.581889
N  -0.325836 1.183825 -0.056482
N  2.917572 0.757116 -0.747978
N  -4.399679 -1.373796 0.184336
C  0.346458 0.550456 -1.217003
C  1.638534 1.393772 -0.888564
C  0.895825 1.84404 0.408192
C  -1.465648 0.715843 0.600196
C  -2.006957 -0.525961 0.296256
C  -1.403535 -1.446709 -0.755472
C  -3.178943 -1.090892 1.064998
C  -2.040896 1.635644 1.651987
C  3.957645 1.0848 -1.62187
C  5.303324 0.382956 -1.361304
C  -5.093102 -2.549975 0.338407
C  -4.830691 -0.413641 -0.699002
C  5.444714 -0.34168 -0.049533
C  -6.256567 -2.796684 -0.405388
C  -5.990465 -0.61426 -1.460753
C  -6.717798 -1.819819 -1.318172
C  5.264807 -1.693162 0.225056
C  5.501346 -2.053098 1.603372
C  5.86601 -0.977175 2.395545
H  -0.142478 0.744618 -2.183134
H  1.766753 2.217112 -1.619346
H  -1.832765 -1.26984 -1.759528
H  -1.588687 -2.50398 -0.497029
H  3.120165 0.129431 0.036691
H  -3.500578 -0.411874 1.874224
H  -2.904121 -2.060317 1.518718
H  5.449048 -0.331984 -2.19376
H  6.081375 1.155626 -1.495307
H  -4.696249 -3.264033 1.063483
H  -4.222183 0.491612 -0.763053
H  -2.012777 3.550561 2.117851
H  -6.786876 -3.741417 -0.265378
H  -6.314397 0.167344 -2.151855
H  -7.6240 -1.99364 -1.90515
H  4.991771 -2.41788 -0.54752
H  5.416852 -3.072421 1.986741
H  6.111965 -0.954175 3.455669
