program: Gaussian 09
title: 000040288
version: EM64L-G09RevD.01
frameworkgroup: C1[X(C20H32N2O3)]
method: RPBEPBE
basis: SDD
operation: Freq
keyword: #p
keyword: freq=noraman
keyword: PBEPBE/SDD
title: #p freq=noraman PBEPBE/SDD
converged: YES YES NO NO
title: Mulliken charges:
elementType: O O O N N C C C C C C C C C C C C C C C C C C C C H H H H H H H H H H H H H H H H H H H H H H H H H H H H H H H H
charge: -0.328129 -0.301060 -0.272925 -0.090024 -0.251340 -0.368655 -0.365743 -0.386618 -0.392079 -0.399743 -0.363622 0.039391 -0.715947 0.271031 -0.358154 0.445911 -0.491315 -0.683299 -0.411756 0.359169 -0.216782 -0.403445 -0.253346 -0.395433 -0.679621 0.209800 0.170460 0.173743 0.229989 0.191274 0.201940 0.202820 0.192933 0.213959 0.189533 0.200191 0.221760 0.242120 0.212112 0.238704 0.223398 0.250988 0.223892 0.323165 0.240972 0.214662 0.247001 0.231833 0.222962 0.251352 0.211590 0.201661 0.216816 0.215756 0.209732 0.212209 0.224205
chargesum: 0.00000
title: Mulliken charges with hydrogens summed into heavy atoms:
elementType: O O O N N C C C C C C C C C C C C C C C C C C C C
charge: -0.328129 -0.301060 -0.272925 -0.090024 -0.251340 0.011605 0.037989 0.006595 0.003673 0.003749 0.058329 0.281511 -0.041732 0.271031 0.116726 0.445911 -0.168150 0.010198 -0.170784 0.359169 0.006179 -0.152092 0.159905 0.037139 -0.033474
polarizability: 3.07937828e+02 -3.57250526e+00 2.79760246e+02 -6.80868656e+00 5.91543940e+00 1.62200752e+02
1716.lowfreq: -15.1788 -9.3375 -0.0006 -0.0005 0.0003 2.4778 6.2269 14.5143 18.0401
frequency: -10.3787 11.3432 17.2053 31.4960 48.0163 55.5840 56.4338 80.7718 87.7768 93.3937 105.6063 121.5577 125.6056 149.1631 185.7494 189.3995 201.7338 206.7050 220.7964 225.4651 236.8666 241.5924 246.9481 283.9535 291.1239 308.3937 339.5343 356.1613 361.5435 377.7796 392.4166 416.9533 433.9316 446.9150 449.8932 460.1792 482.0647 493.9263 564.1747 577.0642 593.4445 612.3462 633.4525 689.3299 695.4313 724.9273 757.8498 770.4409 777.9091 790.2186 800.6415 804.8555 844.7485 849.5048 855.9662 870.2805 873.5905 883.4680 900.4615 902.0745 906.0833 933.0517 955.4664 957.2534 961.3774 966.1146 982.3198 995.5967 1002.9068 1042.3939 1046.2878 1054.7124 1059.9742 1085.7107 1089.5663 1101.8624 1111.9727 1116.9152 1118.9263 1137.1471 1138.5553 1141.8035 1146.0944 1154.6240 1161.4089 1178.3058 1187.8536 1214.5582 1225.8482 1232.5663 1256.5365 1263.6763 1265.4258 1279.4210 1287.2414 1293.0234 1309.3555 1311.4131 1312.4437 1329.0255 1334.2018 1337.3438 1344.0770 1348.6553 1356.3320 1367.2352 1372.0670 1379.2033 1381.8430 1384.6420 1390.4209 1392.7091 1399.0935 1435.0916 1450.2204 1457.7307 1458.8845 1464.6839 1465.5154 1468.4923 1469.5203 1472.2682 1475.1916 1478.9939 1479.7204 1481.0918 1486.0745 1488.5390 1494.5844 1496.6932 1596.0946 1601.8327 1618.3890 2824.9990 2835.2626 2902.2482 2951.6267 2966.4319 2978.4525 2983.4917 2985.1300 2989.4733 2990.5212 3002.6454 3009.6825 3020.6022 3027.7387 3032.5761 3039.3949 3041.1257 3044.7057 3048.2613 3051.8674 3053.9366 3079.9819 3082.2011 3084.1268 3091.3150 3091.5706 3099.0980 3112.8629 3136.6318 3171.6780 3185.3696 3211.0730
redmass: 2.9875 4.0495 4.2135 3.8353 4.6543 3.6695 4.1202 4.0300 2.1852 2.3838 3.3660 3.3779 3.6362 2.8301 2.5068 2.3437 1.7570 1.6563 1.2934 1.4039 2.1169 2.4976 3.0255 2.5163 4.6761 3.9720 3.4486 2.6128 3.9085 2.1266 2.9650 3.2568 3.4441 2.8208 2.6009 3.3506 2.6350 3.8728 2.3003 7.0868 3.4490 5.0753 4.7564 2.4773 5.5298 4.6887 3.7992 1.0915 1.4652 2.1066 1.4851 1.7613 1.5697 2.9633 2.7659 1.4276 1.4501 1.9785 2.1409 1.2143 1.9999 1.5272 1.3179 2.6627 1.3528 4.0892 5.9881 2.4237 3.6229 2.1052 2.1018 2.7670 1.6745 2.2034 1.5900 1.9151 2.4147 2.4729 1.7984 2.2314 1.4986 1.4480 1.5715 1.8538 2.4130 2.1957 1.4690 1.7245 2.7548 1.2636 1.2813 1.1961 1.8067 1.4113 1.1018 1.3659 1.3238 1.3140 1.3646 1.2826 1.4064 1.4323 1.4532 1.4487 1.3031 2.0115 1.3688 1.3343 1.7638 1.2208 1.3680 3.4669 1.3094 3.1899 1.0918 1.0826 1.0868 1.0947 1.0511 1.0771 1.0481 1.1606 1.0704 1.1677 1.0908 1.0412 1.2314 1.1637 1.3068 1.0952 6.7148 6.1685 9.9514 1.0714 1.0701 1.0684 1.0555 1.0626 1.0362 1.0614 1.0612 1.0357 1.0360 1.0603 1.1056 1.0889 1.0887 1.0949 1.0641 1.0891 1.1026 1.0889 1.1018 1.1034 1.1027 1.0990 1.0996 1.0991 1.0972 1.0997 1.1029 1.0878 1.0937 1.0949 1.0905
irintensity: 0.2679 0.0533 0.0762 2.4008 0.8668 0.4481 0.3754 0.0594 0.1341 0.3693 0.5971 0.2927 1.2703 3.1072 1.7439 4.0021 0.2575 0.7225 0.1944 0.4563 0.4504 0.6561 1.3602 1.2566 6.5818 0.8670 6.7259 3.2405 9.8449 3.8911 5.0756 4.9441 6.4071 3.6048 0.8813 3.2374 2.6620 0.5002 1.3937 7.9251 3.2730 0.3928 2.0353 34.2643 3.4740 10.8110 3.9450 0.8612 63.4206 4.2050 0.3721 10.0694 23.5848 25.0597 41.4018 2.9029 22.7707 4.3744 8.1132 11.2525 5.4308 1.0905 4.0781 32.7300 4.7088 89.0771 4.7177 22.8473 79.5308 98.9162 97.7897 5.2128 122.9595 9.2656 26.1937 65.7806 245.7057 21.2309 13.8495 5.9995 2.0206 0.3373 8.5848 15.8404 25.8118 152.0575 43.6037 8.8618 215.3656 0.6510 1.0961 3.4626 140.3806 24.8078 0.1178 3.7683 5.1435 11.5981 3.0071 0.8077 10.4846 1.1992 2.0855 9.9708 49.6253 186.3951 2.7407 12.5151 82.1882 28.1037 10.4908 4.4422 22.2927 57.3026 7.3595 10.1473 14.0247 7.3563 6.3854 6.3302 9.7158 46.9736 1.9921 30.9662 15.0718 13.2362 57.1121 62.5288 9.0604 25.3133 27.2031 189.5927 349.1211 53.0077 127.9975 90.5755 26.4112 38.3712 34.5860 35.3714 33.5651 17.3757 28.8221 27.2316 20.7984 26.1905 43.6529 79.4145 21.7821 12.9851 21.3804 14.7166 0.8691 97.0020 82.4006 50.3441 24.0720 37.6707 16.6903 21.2115 29.6364 15.2757 11.3485 11.7178 15.5147
temp: 298.150 k
press: 1.00000 atm
elementType: 8 8 8 7 7 6 6 6 6 6 6 6 6 6 6 6 6 6 6 6 6 6 6 6 6 1 1 1 1 1 1 1 1 1 1 1 1 1 1 1 1 1 1 1 1 1 1 1 1 1 1 1 1 1 1 1 1
symmnumber: 1
zpe: 1290020.0 jmol-1
zpe.correction: 0.491343 hartree
zpe.thermalcorrener: 0.517348 hartree
zpe.thermalcorrenthalpy: 0.518292 hartree
zpe.thermalcorrgfe: 0.432964 hartree
zpe.sumelectzpe: -1114.544773 hartree
zpe.sumelectthermal: -1114.518768 hartree
zpe.sumelectthermalent: -1114.517824 hartree
zpe.sumelectthermalfe: -1114.603152 hartree
dipole: -2.3342 -0.8666 -1.0905
dipole: 2.7182
quadrupole: -151.7245 -135.3055 -153.9981
quadrupole: -4.0752 1.8439 2.0147
quadrupole: -4.7151 11.7038 -6.9887 -4.0752 1.8439 2.0147
hfenergy: -1115.0361157 hartree
pointgroup: C01 [X(C20H32N2O3)]
dipole: -0.8892198 0.3829216 0.4542019 debye
polarizability: 308.4601701|1.8545058|279.0722948|4.733744|8.5223084|162.3663614 unknown
InChI: InChI=1S/C20H32N2O3/c1-4-14-24-19-11-9-10-18(15-19)22(5-2)20(23)25-17(3)16-21-12-7-6-8-13-21/h9-11,15,17H,4-8,12-14,16H2,1-3H3
charge 0 multiplicity 1
57 atoms
O  -0.963101 2.130412 -0.223809
O  -0.01673 0.041294 -0.690459
O  4.151137 -2.230022 -0.08491
N  -4.105086 0.082874 0.239595
N  1.290387 1.840142 0.167174
C  -5.178253 0.043156 1.264515
C  -3.737927 -1.284311 -0.215764
C  -6.44542 -0.632515 0.698809
C  -4.954819 -2.002098 -0.832992
C  -6.126108 -2.052318 0.1753
C  -2.926088 0.887116 0.632257
C  -2.300006 1.566328 -0.610119
C  -3.122386 2.738171 -1.139207
C  0.116939 1.22699 -0.277419
C  1.221581 3.255092 0.64372
C  2.576498 1.179633 0.134297
C  2.683724 -0.234866 0.024475
C  1.345093 4.291914 -0.491564
C  3.762605 1.957023 0.240363
C  3.959059 -0.844586 0.024073
C  5.024382 1.320964 0.246066
C  5.142544 -0.075302 0.139872
C  2.959635 -3.088228 -0.235538
C  3.461049 -4.52854 -0.363799
C  2.293524 -5.525252 -0.532767
H  -5.406724 1.080769 1.572338
H  -4.847746 -0.513696 2.181678
H  -3.348265 -1.893032 0.642963
H  -2.917117 -1.20919 -0.951271
H  -7.224236 -0.672029 1.484888
H  -6.835498 -0.011729 -0.131067
H  -5.269054 -1.453597 -1.741993
H  -4.662042 -3.024225 -1.141587
H  -7.022538 -2.502248 -0.292034
H  -5.846196 -2.703767 1.029417
H  -3.243534 1.67366 1.342823
H  -2.146463 0.271003 1.139447
H  -2.124426 0.808284 -1.393854
H  -3.166256 3.555063 -0.396232
H  -4.148426 2.381143 -1.336185
H  -2.695749 3.13811 -2.075064
H  0.257032 3.388988 1.155743
H  2.017408 3.388312 1.395516
H  1.774901 -0.824577 -0.081824
H  3.726311 3.04652 0.296785
H  1.328359 5.314629 -0.071513
H  0.49719 4.194222 -1.190197
H  2.282059 4.167006 -1.061475
H  5.92842 1.93479 0.325353
H  6.112709 -0.579643 0.136942
H  2.389736 -2.781369 -1.13696
H  2.302154 -2.97247 0.651513
H  4.146301 -4.590745 -1.229784
H  4.055169 -4.781523 0.534233
H  1.608421 -5.495236 0.335447
H  1.699936 -5.299607 -1.438534
H  2.671431 -6.558688 -0.626882
