program: Gaussian 09
title: 000040280
version: EM64L-G09RevD.01
frameworkgroup: C1[X(C17H26N2O3)]
method: RPBEPBE
basis: SDD
operation: Freq
keyword: #p
keyword: freq=noraman
keyword: PBEPBE/SDD
title: #p freq=noraman PBEPBE/SDD
converged: YES YES NO NO
title: Mulliken charges:
elementType: O O O N N C C C C C C C C C C C C C C C C C H H H H H H H H H H H H H H H H H H H H H H H H H H
charge: -0.310640 -0.277934 -0.271953 -0.084875 -0.463784 -0.369153 -0.371068 -0.388911 -0.383682 -0.399993 -0.341369 -0.306518 0.252824 0.517374 -0.624445 0.408666 -0.252539 -0.394084 -0.391794 -0.389287 -0.196823 -0.678409 0.177557 0.222604 0.210171 0.169549 0.204041 0.193112 0.191308 0.202765 0.213734 0.189530 0.212945 0.221405 0.237965 0.236742 0.332448 0.247498 0.200974 0.201776 0.218139 0.218097 0.299006 0.247527 0.221902 0.210365 0.210044 0.227192
chargesum: 0.00000
title: Mulliken charges with hydrogens summed into heavy atoms:
elementType: O O O N N C C C C C C C C C C C C C C C C C
charge: -0.310640 -0.277934 -0.271953 -0.084875 -0.131335 0.031007 0.008653 0.008242 0.010391 0.003271 0.092981 0.168189 0.252824 0.517374 -0.376947 0.408666 0.150211 0.042152 -0.092789 -0.141760 0.025080 -0.030808
polarizability: 3.31878682e+02 3.95609697e-01 1.94201438e+02 -1.12312688e+01 5.99018937e+00 1.36496748e+02
1716.lowfreq: -17.7032 -6.0324 -2.8072 -0.7455 -0.0017 -0.0010 0.0016 14.2073 26.5266
frequency: -6.1938 13.8134 26.2293 35.0607 55.7072 60.8782 69.1458 80.4965 87.6800 99.6715 132.5374 137.0488 193.9504 213.4797 225.0642 234.5343 240.9508 245.3975 260.8373 279.1611 300.1632 320.7676 356.3426 360.3964 378.4415 398.5390 447.2310 453.4430 468.6590 484.1101 560.2914 586.1510 599.4019 624.8665 648.7637 667.5317 688.3719 699.8566 751.6548 765.3372 766.0333 781.7493 793.1543 804.5583 848.4817 853.7046 866.2471 880.3380 881.8882 896.3183 897.8003 903.0136 918.7805 955.7068 977.0066 978.2187 990.7624 993.9033 1026.7238 1045.9165 1050.6463 1053.9839 1067.5900 1099.7496 1101.5362 1114.1041 1130.4730 1135.3737 1140.6143 1149.9055 1154.4315 1160.5632 1170.4372 1194.1908 1197.9191 1227.8425 1256.8209 1263.2877 1267.0400 1273.4810 1283.1962 1293.8123 1295.6777 1307.4095 1315.3067 1317.4092 1330.9245 1339.7732 1347.1671 1353.9461 1371.0867 1373.6267 1389.2553 1393.8831 1396.1175 1421.9727 1448.7782 1449.5932 1458.6990 1461.7587 1466.3280 1472.3020 1475.7959 1479.7683 1481.7793 1482.2238 1485.5690 1491.4792 1526.3999 1595.3472 1626.0636 1665.5838 2826.6422 2838.2732 2902.8219 2944.8315 2966.0417 2978.4852 2984.2529 2986.4774 3002.5170 3003.2437 3023.8473 3032.0992 3037.4896 3039.1883 3043.9782 3046.0070 3051.9386 3055.0585 3080.3496 3083.4906 3125.8582 3137.3572 3141.5340 3171.0188 3198.7772 3543.1301
redmass: 4.4369 4.5134 3.0112 4.1057 3.9273 4.2674 3.8894 2.4216 3.6842 3.6900 2.9968 3.0686 4.1992 2.8088 1.5669 2.2430 2.2298 3.2681 3.9435 3.7522 3.0928 2.7103 3.0450 4.2441 2.9465 2.4597 2.8438 2.9425 2.9251 4.1989 2.1334 6.1697 2.8674 5.4023 1.6560 4.9691 2.0081 4.9669 4.4461 1.1214 3.8561 1.3228 1.4369 1.4125 1.5874 2.3195 1.7255 3.6505 1.3645 1.2447 2.9138 2.2372 2.7300 1.3092 1.3021 6.1053 5.8752 2.7618 3.2065 2.1575 1.8522 2.7391 3.3614 1.6119 1.7228 2.1993 1.8101 2.1979 1.4293 1.3473 2.5083 2.2748 1.8467 1.3268 1.3807 1.2773 1.3591 1.3367 1.2258 2.1567 1.1061 1.1978 1.3605 1.3481 1.6480 1.3420 1.3051 1.4231 1.4690 1.3878 1.3847 1.5953 1.6624 1.7808 1.7563 2.6823 1.0915 1.0920 1.0875 1.0883 1.0876 1.0848 1.0856 1.1690 1.0961 1.0444 1.9847 1.1574 2.2327 5.2998 6.5551 8.3661 1.0713 1.0702 1.0691 1.0550 1.0626 1.0362 1.0615 1.0611 1.1062 1.0601 1.0884 1.0946 1.0795 1.0893 1.0705 1.1024 1.1016 1.1035 1.1028 1.0989 1.1078 1.0884 1.0917 1.0942 1.0950 1.0760
irintensity: 0.2226 0.2872 0.0843 0.0763 1.4294 0.7065 3.4882 1.1888 0.0962 0.1035 3.5464 2.3195 2.4126 4.2364 0.2535 0.3092 0.0979 0.4858 1.8489 15.1847 3.4806 13.3179 4.2082 0.1880 12.3799 8.0581 0.4347 7.8091 4.9573 1.8052 0.4487 9.7399 12.0730 0.2993 27.2714 13.7653 28.5466 54.2577 5.9528 22.1121 7.3044 25.7419 0.9472 0.2364 3.4516 12.2498 56.1680 29.5131 15.9096 1.0375 10.2504 4.6208 6.7471 2.3918 3.3109 101.5809 253.9169 123.7922 25.5867 29.6846 78.9662 4.7326 1.0747 18.6964 41.6881 8.6097 1.5472 7.2595 0.2997 9.3571 124.3665 73.5031 414.4771 73.0054 0.9730 0.2330 2.7289 6.7114 17.0717 134.7445 0.0231 4.7906 8.0376 7.1583 14.9206 4.8152 0.8596 0.6215 2.2224 1.8786 3.0318 3.1915 62.4978 13.0417 139.9099 151.2812 29.3899 6.9440 12.3553 7.9263 7.1976 14.9502 3.5242 22.4541 13.8010 14.7036 166.8140 27.7684 309.2669 70.9408 384.0041 220.9430 60.0214 124.1212 84.9148 37.1820 39.1747 40.5327 35.7915 34.0739 28.4887 23.8710 47.6305 81.4089 33.1244 4.7591 47.7709 12.1570 0.3747 101.6677 83.4311 43.9260 15.9458 17.2498 3.6595 11.8025 6.5496 30.0034
temp: 298.150 k
press: 1.00000 atm
elementType: 8 8 8 7 7 6 6 6 6 6 6 6 6 6 6 6 6 6 6 6 6 6 1 1 1 1 1 1 1 1 1 1 1 1 1 1 1 1 1 1 1 1 1 1 1 1 1 1
symmnumber: 1
zpe: 1072841.0 jmol-1
zpe.correction: 0.408624 hartree
zpe.thermalcorrener: 0.430466 hartree
zpe.thermalcorrenthalpy: 0.431410 hartree
zpe.thermalcorrgfe: 0.355139 hartree
zpe.sumelectzpe: -996.880177 hartree
zpe.sumelectthermal: -996.858335 hartree
zpe.sumelectthermalent: -996.857391 hartree
zpe.sumelectthermalfe: -996.933662 hartree
dipole: -1.4133 -1.0018 1.0205
dipole: 2.0106
quadrupole: -99.0226 -129.2637 -135.1168
quadrupole: -4.8413 0.3621 1.4191
quadrupole: 22.1118 -8.1293 -13.9824 -4.8413 0.3621 1.4191
hfenergy: -997.2888009 hartree
pointgroup: C01 [X(C17H26N2O3)]
dipole: -0.5642809 0.3412392 -0.4368774 debye
polarizability: 332.2636504|0.617358|194.7731104|7.104833|-1.5560951|135.5401073 unknown
InChI: InChI=1S/C17H26N2O3/c1-2-12-21-16-8-6-7-15(14-16)18-17(20)22-13-11-19-9-4-3-5-10-19/h6-8,14,18H,2-5,9-13H2,1H3
charge 0 multiplicity 1
48 atoms
O  1.507584 1.244699 0.918646
O  -5.383546 0.659942 0.076412
O  1.073672 -1.07294 0.790526
N  5.053516 0.487591 -0.159566
N  -0.626134 0.578665 0.628247
C  5.248503 -0.984078 -0.079425
C  5.967462 1.104814 -1.152823
C  6.696068 -1.325622 0.327572
C  7.439881 0.832088 -0.780332
C  7.703667 -0.686605 -0.656108
C  3.633078 0.869483 -0.326023
C  2.958941 0.950946 1.057128
C  0.671007 0.117304 0.773422
C  -1.814743 -0.185588 0.467149
C  -3.027834 0.532335 0.346582
C  -4.249145 -0.159703 0.184854
C  -6.694075 0.005179 -0.09096
C  -7.74098 1.117087 -0.193172
C  -1.81693 -1.607148 0.424869
C  -4.271222 -1.576519 0.141616
C  -3.047224 -2.273298 0.262744
C  -9.16426 0.545337 -0.373814
H  5.020187 -1.465976 -1.067012
H  4.534971 -1.401691 0.653522
H  5.777409 2.194199 -1.173667
H  5.774814 0.710465 -2.18614
H  6.879138 -0.940895 1.349444
H  6.820707 -2.425355 0.354283
H  8.102898 1.28348 -1.543639
H  7.655068 1.324519 0.187848
H  8.742504 -0.872566 -0.323494
H  7.593605 -1.16177 -1.653293
H  3.577272 1.86076 -0.811843
H  3.068513 0.152356 -0.967846
H  3.080781 0.00496 1.611603
H  3.36146 1.789831 1.644136
H  -0.721145 1.596335 0.651083
H  -3.050787 1.627559 0.376276
H  -6.685933 -0.618402 -1.009838
H  -6.896959 -0.65182 0.780899
H  -7.690877 1.738584 0.720276
H  -7.480569 1.77431 -1.043584
H  -0.879264 -2.156666 0.518846
H  -5.205792 -2.129963 0.018989
H  -3.055058 -3.368633 0.230275
H  -9.24448 -0.053195 -1.300695
H  -9.448527 -0.104998 0.474858
H  -9.907423 1.359703 -0.435331
