program: Gaussian 09
title: 000040296
version: EM64L-G09RevD.01
frameworkgroup: C1[X(C21H34N2O3)]
method: RPBEPBE
basis: SDD
operation: Freq
keyword: #p
keyword: freq=noraman
keyword: PBEPBE/SDD
title: #p freq=noraman PBEPBE/SDD
converged: YES YES NO NO
title: Mulliken charges:
elementType: O O O N N C C C C C C C C C C C C C C C C C C C C C H H H H H H H H H H H H H H H H H H H H H H H H H H H H H H H H H H
charge: -0.318744 -0.267421 -0.276769 -0.079765 -0.257873 -0.369756 -0.361084 -0.387398 -0.393213 -0.398667 -0.355044 -0.259996 0.269892 -0.399534 -0.339439 0.464570 -0.362519 -0.302534 -0.350970 -0.524150 0.355123 -0.377500 -0.681191 -0.693217 -0.405472 -0.193851 0.167469 0.212504 0.208995 0.173083 0.192488 0.205990 0.208197 0.192996 0.215410 0.188777 0.214789 0.194015 0.229524 0.239391 0.212454 0.212977 0.184971 0.185226 0.253395 0.225766 0.200263 0.201705 0.197829 0.198093 0.261133 0.288969 0.249232 0.221784 0.213884 0.218831 0.209381 0.209742 0.251698 0.225561
chargesum: 0.00000
title: Mulliken charges with hydrogens summed into heavy atoms:
elementType: O O O N N C C C C C C C C C C C C C C C C C C C C C
charge: -0.318744 -0.267421 -0.276769 -0.079765 -0.257873 0.010218 0.020995 0.011080 0.007980 0.005520 0.053761 0.208919 0.269892 0.025897 0.030757 0.464570 0.116641 0.099434 0.044952 -0.263017 0.355123 -0.088531 0.003709 -0.055264 -0.153773 0.031710
polarizability: 3.59909209e+02 -1.84960631e+00 2.61226477e+02 -1.81991126e+00 -4.73457535e+00 1.68734254e+02
1716.lowfreq: -13.5222 -8.0820 -5.0937 -0.0013 0.0005 0.0010 4.2555 5.8984 15.5109
frequency: -10.9446 4.1399 15.4393 25.3234 32.9603 39.2654 46.7013 57.3130 77.3297 84.1507 102.0164 104.5868 111.2998 123.8820 134.1060 140.0192 148.3705 171.7411 190.3588 198.5985 226.2561 228.6568 231.8827 235.9489 248.4265 271.9099 295.9646 312.3245 350.3264 363.3062 373.6142 386.2462 417.1398 424.0621 443.0312 448.5757 460.9816 474.7337 491.9269 557.2651 582.1697 593.1552 611.6437 628.1629 683.9493 696.1444 716.6641 731.1084 752.0856 772.2873 782.7756 789.9559 796.7983 805.5080 823.4143 836.6880 855.5245 857.7718 860.7346 884.6457 889.1542 904.3850 924.5239 948.9364 958.6316 969.1116 971.1197 977.1094 985.5069 995.1520 1010.8272 1022.6122 1045.0835 1051.6639 1072.3519 1076.4218 1077.9050 1087.1438 1088.0301 1101.3648 1107.2349 1115.8767 1119.6436 1124.9646 1127.1074 1146.0094 1149.9053 1159.4464 1174.2744 1178.3623 1189.0496 1202.0840 1227.4844 1241.9393 1252.5165 1257.7353 1260.5194 1264.9584 1265.4592 1281.5434 1283.1567 1291.4634 1291.5798 1311.5618 1316.5613 1318.9204 1331.1715 1340.5630 1345.8854 1351.3480 1352.9873 1354.4975 1361.5902 1374.1265 1375.8858 1383.2092 1391.1449 1392.7881 1398.4158 1436.6922 1451.1813 1460.4460 1460.5895 1464.0767 1466.7585 1467.3951 1467.5074 1471.6691 1474.8388 1478.3117 1479.0438 1481.6262 1483.7487 1485.3824 1488.8648 1491.8401 1494.1436 1595.4039 1606.6436 1633.4608 2819.1525 2828.9518 2881.8445 2936.4682 2954.9847 2968.0803 2971.1191 2973.4390 2986.4323 2987.6713 2988.6371 2992.5888 2995.5221 2995.9514 3021.1251 3023.7908 3025.8921 3031.9845 3033.2012 3036.5592 3037.5729 3047.4354 3056.6138 3061.5690 3070.6176 3073.5783 3077.9641 3089.1965 3093.6207 3108.2966 3140.1013 3173.0080 3184.5274 3210.4035
redmass: 3.1302 3.9568 3.9317 4.3244 3.4940 3.8232 1.8308 4.3962 3.5409 3.3017 2.8442 4.4620 3.0497 1.9033 3.5614 3.0445 2.4740 3.8824 2.7775 1.2253 3.9599 2.1611 2.4676 1.4143 2.5426 3.9733 3.9452 2.5902 4.5487 3.4187 2.4692 2.1722 3.3113 3.2950 3.6426 2.9046 3.2086 3.1499 4.2287 2.0950 5.5355 4.0163 4.8245 4.9433 1.9895 9.4389 4.9078 1.0717 3.5536 1.1189 1.3057 1.2649 1.3319 1.4005 4.6339 1.6853 1.6129 2.2628 1.2058 1.4653 2.0478 2.3401 4.3555 2.5002 1.3027 1.1485 1.3675 5.1753 6.0520 2.5135 3.6277 3.4823 1.9532 1.9155 2.4475 2.4245 2.3615 2.3595 2.0432 1.5853 2.3619 2.1196 1.8800 2.0881 2.6240 1.4344 1.3069 2.4061 1.5234 1.1864 1.6213 1.4633 3.3361 1.6927 1.2936 1.2457 1.2455 1.1822 1.9090 1.2260 1.0577 1.1204 1.3807 1.3190 1.3492 1.3622 1.2941 1.4221 1.5030 1.4484 1.3332 1.5542 1.7982 1.5105 1.8057 1.2296 1.7058 1.9781 1.5161 3.0021 1.0910 1.0853 1.0847 1.0625 1.0700 1.0894 1.0903 1.0809 1.1428 1.0930 1.0462 1.2100 1.0847 1.0746 1.2034 1.0739 1.5201 6.8615 6.0556 11.3655 1.0714 1.0699 1.0698 1.0547 1.0587 1.0626 1.0584 1.0372 1.0616 1.0611 1.0361 1.1057 1.0605 1.0981 1.0608 1.0875 1.1032 1.0895 1.0619 1.0883 1.0919 1.1034 1.1036 1.1044 1.1012 1.0992 1.1002 1.0985 1.1085 1.1030 1.0885 1.0955 1.0895 1.0941
irintensity: 0.1346 0.1769 0.5487 0.0521 0.1520 0.6283 0.0364 0.5263 1.1571 1.3183 0.3262 0.1118 0.9457 0.6344 1.7375 0.5674 2.6227 1.0532 1.7390 0.6406 0.8703 2.9494 0.5098 0.1305 1.7442 1.0745 5.7538 11.7759 4.4949 1.0449 9.2111 3.1077 12.9963 5.5063 0.7254 0.5756 6.1891 3.1288 0.4075 1.5974 10.2640 0.9235 1.9179 2.0256 27.5975 10.5946 9.0990 10.7042 9.7199 0.6098 39.1108 3.9985 14.7538 0.1297 48.8711 45.3044 5.7025 3.4338 0.9267 0.4645 6.7273 2.1367 68.1510 1.5857 3.5138 1.1854 6.3757 125.0683 58.9191 42.7386 53.1533 12.7973 26.4312 23.4748 32.1006 7.3244 18.4930 41.9641 6.7934 32.9914 446.1975 16.9890 45.9177 2.0129 1.9787 0.3545 5.1579 37.2923 41.2943 5.7304 9.9791 0.5105 503.5130 20.7816 7.6921 1.6568 0.0830 4.5006 67.5213 9.4464 0.0427 0.7866 8.3320 0.4846 12.2601 2.4253 0.1853 0.4313 8.1010 21.6852 2.3950 3.5777 167.2839 90.1689 9.1770 25.6038 1.0723 22.3717 20.6385 47.6130 7.3998 10.7986 6.4297 1.7448 0.7732 12.2955 2.2574 5.9236 39.8636 6.5071 13.9205 28.2197 12.1801 11.8699 96.3354 17.3131 35.4461 56.8048 260.8753 268.9281 44.1637 143.9248 102.1891 27.3329 16.1538 39.5055 54.2601 32.8155 33.3995 34.8591 22.7464 29.1534 38.6797 2.5266 31.6650 46.1134 15.3556 57.5340 22.9405 50.1032 15.0213 18.2122 96.0035 26.8034 119.2469 54.4495 19.1013 24.8379 32.4244 37.7365 16.3110 9.7348 5.7921 1.7005
temp: 298.150 k
press: 1.00000 atm
elementType: 8 8 8 7 7 6 6 6 6 6 6 6 6 6 6 6 6 6 6 6 6 6 6 6 6 6 1 1 1 1 1 1 1 1 1 1 1 1 1 1 1 1 1 1 1 1 1 1 1 1 1 1 1 1 1 1 1 1 1 1
symmnumber: 1
zpe: 1363138.1 jmol-1
zpe.correction: 0.519192 hartree
zpe.thermalcorrener: 0.546840 hartree
zpe.thermalcorrenthalpy: 0.547784 hartree
zpe.thermalcorrgfe: 0.456105 hartree
zpe.sumelectzpe: -1153.758049 hartree
zpe.sumelectthermal: -1153.730401 hartree
zpe.sumelectthermalent: -1153.729457 hartree
zpe.sumelectthermalfe: -1153.821136 hartree
dipole: 0.2494 -4.3956 1.9191
dipole: 4.8028
quadrupole: -137.0008 -158.8961 -161.8211
quadrupole: 3.3974 4.1890 2.5495
quadrupole: 15.5719 -6.3234 -9.2484 3.3974 4.1890 2.5495
hfenergy: -1154.2772409 hartree
pointgroup: C01 [X(C21H34N2O3)]
dipole: 0.1370174 -1.6318527 0.9427169 debye
polarizability: 359.944858|1.1233346|259.0302134|0.8043999|-14.7924317|170.8948695 unknown
InChI: InChI=1S/C21H34N2O3/c1-3-5-9-16-25-20-12-10-11-19(18-20)23(4-2)21(24)26-17-15-22-13-7-6-8-14-22/h10-12,18H,3-9,13-17H2,1-2H3
charge 0 multiplicity 1
60 atoms
O  2.159277 -0.085299 0.10012
O  -4.951064 1.088443 -0.313876
O  1.543431 1.873506 -1.019204
N  5.83922 -0.743134 -0.060118
N  -0.048552 0.570363 0.180185
C  6.602404 -2.018004 -0.025122
C  6.514524 0.312892 0.739704
C  8.030131 -1.822471 -0.574555
C  7.938853 0.582869 0.213762
C  8.773807 -0.717685 0.210124
C  4.414329 -0.915811 0.307942
C  3.550493 0.156116 -0.369632
C  1.219913 0.885861 -0.310676
C  -6.647065 -0.62663 -0.162773
C  -6.980104 -2.120683 0.05242
C  -1.197942 1.399795 -0.101421
C  -0.225553 -0.668097 0.996061
C  -5.143057 -0.354478 -0.087641
C  -8.496006 -2.412569 -0.031599
C  -2.490079 0.801936 -0.084828
C  -3.639847 1.594976 -0.308042
C  -1.07559 2.790089 -0.355302
C  -0.348677 -1.956027 0.155105
C  -8.832499 -3.904481 0.176533
C  -3.523532 2.983283 -0.555616
C  -2.239709 3.558275 -0.580618
H  6.666482 -2.423952 1.020167
H  6.060774 -2.763677 -0.636587
H  5.914576 1.239591 0.690726
H  6.57313 0.012756 1.820831
H  8.579598 -2.781879 -0.516808
H  7.962682 -1.536394 -1.641934
H  7.868292 0.982383 -0.816134
H  8.42129 1.35584 0.842489
H  9.773111 -0.536289 -0.228621
H  8.935176 -1.053798 1.255649
H  4.075696 -1.90929 -0.039121
H  4.248125 -0.881005 1.412886
H  3.848825 1.183172 -0.095853
H  3.589458 0.065107 -1.468526
H  -7.160905 -0.009861 0.599258
H  -7.020041 -0.293808 -1.15031
H  -6.601428 -2.450628 1.042782
H  -6.45001 -2.734811 -0.705687
H  0.642886 -0.756167 1.667881
H  -1.119301 -0.518617 1.625057
H  -4.738551 -0.63485 0.908665
H  -4.597928 -0.930634 -0.865808
H  -9.026526 -1.801873 0.726849
H  -8.875353 -2.080092 -1.019152
H  -2.59448 -0.27302 0.07144
H  -0.091146 3.254879 -0.397045
H  0.576947 -2.123919 -0.42007
H  -1.193343 -1.907696 -0.554688
H  -0.503447 -2.826166 0.819781
H  -9.920699 -4.085914 0.107991
H  -8.494158 -4.253996 1.170358
H  -8.336551 -4.533396 -0.586805
H  -4.428903 3.572313 -0.726202
H  -2.135685 4.631654 -0.77369
