program: Gaussian 09
title: 000040225
version: EM64L-G09RevD.01
frameworkgroup: C1[X(C10H9NO2)]
method: RPBEPBE
basis: SDD
operation: Freq
keyword: #p
keyword: freq=noraman
keyword: PBEPBE/SDD
title: #p freq=noraman PBEPBE/SDD
converged: NO YES NO NO
title: Mulliken charges:
elementType: O O N C C C C C C C C C C H H H H H H H H H
charge: -0.275935 -0.449035 -0.458049 0.221831 0.295489 0.318741 -0.496694 -0.345366 -0.411319 0.020666 -0.205028 -0.243444 -0.346105 0.337817 0.266776 0.242283 0.244796 0.228931 0.228799 0.228356 0.228205 0.368284
chargesum: 0.00000
title: Mulliken charges with hydrogens summed into heavy atoms:
elementType: O O N C C C C C C C C C C
charge: -0.275935 -0.080751 -0.120232 0.221831 0.295489 0.318741 -0.229918 -0.103083 -0.166523 0.020666 0.023903 -0.014644 0.110456
polarizability: 2.23835922e+02 -6.77191287e+00 1.21802937e+02 6.84117400e-04 -1.15236241e-02 5.17743346e+01
1716.lowfreq: -5.4729 -0.0008 -0.0006 -0.0006 1.8324 4.9141 60.8561 79.6782 100.4838
frequency: 60.8502 79.6387 100.4835 111.1522 250.0834 263.4776 271.6222 314.1459 369.1391 413.0267 441.6429 520.2936 532.9619 567.1708 573.5483 603.8204 643.8541 658.1321 736.7665 749.7165 759.6956 796.4489 827.6471 863.9930 882.1672 916.7991 945.8663 981.2933 996.8712 1002.2306 1013.2961 1069.6932 1120.1868 1165.3329 1178.9036 1180.2996 1231.6742 1236.2616 1254.6034 1326.2390 1340.0505 1378.9879 1405.7017 1412.4869 1448.9702 1457.4768 1490.9838 1516.4679 1572.1207 1580.4337 1632.0879 2959.9855 2999.1026 3131.1382 3140.0291 3153.1736 3167.9094 3215.7073 3400.4849 3583.0906
redmass: 5.8476 2.9599 5.8906 5.2971 3.7289 4.8945 6.5206 5.8131 6.0156 1.6254 1.7738 4.9786 2.6223 3.3082 6.3681 6.4065 1.1307 3.4823 5.6131 1.3750 2.8396 3.9760 1.3738 1.5885 5.3371 6.2750 1.3802 1.3171 2.0601 3.1963 3.1565 2.4014 1.6148 1.1572 1.0747 1.3677 1.3796 2.2481 1.4923 2.8840 2.1562 1.7380 3.3214 3.0127 3.2389 1.2682 3.1662 4.9012 7.0514 5.7330 7.4544 1.0571 1.1032 1.0853 1.0892 1.0960 1.1004 1.0980 1.0641 1.0806
irintensity: 2.9402 6.5585 2.1102 5.9036 0.0647 0.0063 17.4963 18.0153 24.5678 32.8854 91.2291 1.4166 10.7649 0.3062 7.1209 1.6807 79.7709 19.9817 14.2764 46.2181 37.7272 15.6839 66.9218 7.5575 1.0004 82.0221 5.9615 0.0004 0.0708 49.7412 77.2156 43.7073 7.0564 22.7946 4.9188 26.4111 42.6460 3.8398 161.8334 10.4689 161.1342 163.1025 9.0887 5.6311 35.9295 2.0489 1.1502 24.5023 302.4864 14.3787 22.2413 50.5699 23.8328 0.0059 2.2092 25.3520 29.5950 1.0141 32.3496 92.1207
temp: 298.150 k
press: 1.00000 atm
elementType: 8 8 7 6 6 6 6 6 6 6 6 6 6 1 1 1 1 1 1 1 1 1
symmnumber: 1
zpe: 442602.8 jmol-1
zpe.correction: 0.168579 hartree
zpe.thermalcorrener: 0.179379 hartree
zpe.thermalcorrenthalpy: 0.180323 hartree
zpe.thermalcorrgfe: 0.131513 hartree
zpe.sumelectzpe: -590.748574 hartree
zpe.sumelectthermal: -590.737774 hartree
zpe.sumelectthermalent: -590.736829 hartree
zpe.sumelectthermalfe: -590.785640 hartree
dipole: 4.4003 -0.2186 0.0072
dipole: 4.4058
quadrupole: -88.4672 -66.5391 -79.3892
quadrupole: 1.1175 -0.0207 0.0006
quadrupole: -10.3354 11.5927 -1.2574 1.1175 -0.0207 0.0006
hfenergy: -590.9171523 hartree
pointgroup: C01 [X(C10H9N1O2)]
dipole: -1.7315266 -0.0659831 -0.0446593 debye
dipolederiv: -1.1010305 -0.1025926 -0.0190669 -0.7141126 -0.8443217 -0.0208958 -0.023696 -0.0068801 -0.3284029 -0.9235227 -0.1159003 -0.0100994 -0.0746338 -0.2736815 -0.0001629 -0.0107255 -0.0007924 -0.5478532 -0.3098206 0.062915 -0.0005344 -0.2705475 -0.5049866 -0.011005 -0.005304 -0.0045048 -0.2627226 0.1989881 0.1401964 0.005539 0.108643 0.0104762 0.0029261 0.0046589 0.0042389 0.0664604 -0.2854411 0.0719051 -0.0061673 0.0108087 -0.1490855 -0.0015108 -0.0066649 0.0003163 0.0133967 -1.4408495 -0.2899025 -0.038194 -0.3875214 0.3367475 -0.0044327 -0.0392365 -0.0027733 0.0315759 0.5018425 -0.1040608 0.0160839 0.2380209 -0.0315181 0.00683 0.0205644 -0.0015894 -0.2144309 0.0255211 -0.1337296 0.0036372 -0.073257 0.0606702 0.0009413 0.0046289 -0.0005699 -0.1935611 0.3369578 -0.0512786 0.0112072 0.1130492 0.1299276 0.0054357 0.0130423 0.0015555 -0.1589999 2.0357457 0.1436399 0.0461953 0.3651352 0.8893174 0.0151464 0.0468911 0.0101503 0.0982222 -0.1112635 -0.0090675 0.0010205 -0.2511801 0.1511093 -0.0027901 -0.0014616 0.0026547 -0.1527742 -0.1375002 0.1362108 0.00238 0.3966441 -0.0816089 0.0102686 0.0049879 0.0041558 -0.176555 0.4584634 0.268967 0.0047414 0.6480212 -0.067265 0.0117328 0.0094113 0.0024204 0.3835561 0.20686 -0.0072709 -0.0031376 0.0631425 0.2590025 0.00109 -0.0017095 0.0008068 0.3342513 0.0680382 0.0510758 -0.0022423 0.073331 0.0109922 0.0002608 -0.0024542 0.0000486 0.1779701 0.074699 -0.0262094 -0.0027668 0.0345274 -0.0882421 -0.0019241 -0.0020636 -0.0034465 0.1794912 0.0833466 0.0233874 -0.0016389 -0.0336995 -0.0907954 -0.0032662 -0.0021615 -0.0018958 0.1619764 -0.0827689 0.0914936 -0.0049011 0.0891926 0.0405832 0.0009363 -0.0050394 0.0011074 0.1603141 -0.0968926 -0.0928032 -0.0072368 -0.0923448 0.0363993 -0.0035 -0.007322 -0.003484 0.1666055 -0.0366148 -0.0578712 -0.0579051 -0.0628495 0.0277404 -0.0718537 -0.0839455 -0.1029473 -0.0510812 -0.0439948 -0.0643368 0.0573275 -0.0679968 0.0244638 0.0698057 0.0833635 0.1011609 -0.0407501 0.5792369 0.0652323 0.0057587 -0.1123729 0.1540751 -0.0040324 0.004236 0.0002679 0.3533113 unknown
polarizability: 223.8787602|5.573089|121.6533395|4.1492235|0.8191583|51.8810935 unknown
InChI: InChI=1S/C10H9NO2/c12-6-10(13)9-5-7-3-1-2-4-8(7)11-9/h1-5,11-12H,6H2
charge 0 multiplicity 1
22 atoms
O  2.892846 1.396878 0.120716
O  4.729018 -0.541279 0.150094
N  0.088649 1.103318 0.05656
C  -1.227441 0.660084 0.018429
C  -1.195933 -0.788576 0.004704
C  0.956941 -0.002023 0.06584
C  0.186261 -1.181965 0.03397
C  -2.442466 1.385239 -0.003071
C  -2.423711 -1.509637 -0.031562
C  2.396869 0.217324 0.099506
C  -3.635936 0.64207 -0.039219
C  -3.628453 -0.789729 -0.053297
C  3.3527 -0.981566 0.111197
H  0.428166 2.065407 0.069643
H  0.574672 -2.199629 0.034213
H  -2.458819 2.480083 0.007989
H  -2.425415 -2.604875 -0.042249
H  -4.596086 1.169661 -0.056971
H  -4.583715 -1.324813 -0.081541
H  3.177054 -1.595012 -0.796825
H  3.13089 -1.611902 0.997056
H  4.706711 0.459641 0.156818
