program: Gaussian 09
title: 000040286
version: EM64L-G09RevD.01
frameworkgroup: C1[X(C19H30N2O3)]
method: RPBEPBE
basis: SDD
operation: Freq
keyword: #p
keyword: freq=noraman
keyword: PBEPBE/SDD
title: #p freq=noraman PBEPBE/SDD
converged: YES YES NO NO
title: Mulliken charges:
elementType: O O O N N C C C C C C C C C C C C C C C C C C C H H H H H H H H H H H H H H H H H H H H H H H H H H H H H H
charge: -0.318174 -0.294787 -0.272775 -0.080559 -0.250939 -0.370908 -0.362598 -0.386686 -0.392299 -0.398994 -0.355839 -0.260995 0.283718 0.446200 -0.359361 -0.492821 -0.410111 -0.682197 0.360081 -0.216555 -0.403307 -0.253589 -0.395588 -0.679183 0.213091 0.167956 0.174188 0.208078 0.193023 0.205682 0.207674 0.192913 0.215648 0.189105 0.194795 0.216574 0.228600 0.240127 0.252605 0.225165 0.324189 0.240238 0.214809 0.243377 0.232830 0.222820 0.251417 0.202201 0.212379 0.216583 0.215520 0.210208 0.212686 0.223786
chargesum: 0.00000
title: Mulliken charges with hydrogens summed into heavy atoms:
elementType: O O O N N C C C C C C C C C C C C C C C C C C C
charge: -0.318174 -0.294787 -0.272775 -0.080559 -0.250939 0.010139 0.019668 0.012018 0.008287 0.005759 0.055531 0.207732 0.283718 0.446200 0.118409 -0.168631 -0.169874 0.008819 0.360081 0.006265 -0.151891 0.160991 0.036515 -0.032503
polarizability: 3.08727724e+02 1.93200848e+00 2.58014978e+02 -2.72477897e+00 -1.75261839e+00 1.51970309e+02
1716.lowfreq: -9.7552 -4.8412 -2.3291 -0.0010 -0.0008 -0.0003 5.5116 19.1445 22.4165
frequency: -7.0610 19.0516 21.9508 30.9421 47.8217 56.8883 61.1151 80.0690 84.7485 103.2262 112.1932 121.0978 139.3927 150.1588 163.7664 185.9450 197.9769 218.8866 226.8951 233.9798 242.9521 248.9623 289.2791 308.1622 319.7532 355.8315 360.0379 376.0412 391.3371 417.6610 438.5051 450.1839 458.6777 474.4259 492.5138 556.8774 577.1456 595.2714 610.9998 632.3548 687.2951 695.5183 724.1567 752.6510 768.6145 775.3023 788.9246 797.9104 805.7992 825.4174 854.3430 858.8920 868.1085 871.3411 898.1558 900.0107 904.6774 913.4274 956.5653 957.4197 961.3549 977.7121 984.0142 996.0066 1010.3981 1045.2822 1049.3446 1054.0351 1085.1148 1087.3116 1090.0324 1100.6992 1110.0419 1115.4779 1118.8273 1124.9165 1136.4248 1142.1197 1149.4912 1159.0210 1176.2973 1178.6115 1188.7173 1225.2059 1232.0153 1243.1815 1257.5454 1263.8995 1264.7780 1280.9833 1286.1209 1291.1326 1308.7643 1310.6261 1314.9289 1330.4209 1340.2664 1346.0253 1350.5228 1356.0455 1364.9863 1373.5008 1381.4102 1384.2453 1391.7809 1396.6692 1397.1414 1435.1508 1451.4122 1461.6953 1462.2847 1465.5250 1466.3756 1471.4520 1472.2788 1477.2384 1478.8403 1480.0215 1483.7345 1485.5125 1488.3794 1494.8774 1496.8516 1596.2370 1604.3331 1625.1878 2818.5779 2829.1119 2883.9614 2952.7229 2966.2900 2978.2821 2985.9456 2987.0930 2990.2495 3002.3826 3011.0280 3021.9528 3022.8527 3031.2686 3036.7441 3039.5504 3041.0621 3046.9525 3051.8725 3055.8577 3080.1633 3082.1870 3084.4330 3090.7269 3095.5261 3112.7780 3136.8939 3172.0408 3184.7972 3205.9704
redmass: 3.1517 3.9338 4.0816 4.4679 3.9032 3.5351 4.3924 1.7307 3.5719 3.2129 3.2077 3.1039 3.1829 2.9244 4.4261 3.0890 1.1302 1.4353 2.7592 1.9414 3.0708 2.9150 4.0668 2.9767 2.9686 4.1720 4.7932 2.1112 2.6200 3.4804 3.3185 2.8634 3.3336 3.0339 3.9196 2.0877 7.1316 3.6524 5.1709 4.7256 2.1468 7.6322 4.6569 3.3095 1.0931 1.4637 1.3004 1.4400 1.3981 3.3243 1.6561 2.1439 1.4251 1.4843 1.9344 1.2987 2.2118 3.3597 1.3320 2.5414 1.3113 5.6967 6.3876 2.5118 3.8482 1.8668 1.9889 2.7943 2.2483 2.8159 1.6158 1.5605 2.3954 2.1101 1.7573 2.0789 2.2358 1.4542 1.3265 2.3885 1.6087 1.5901 1.4065 2.6906 1.2604 1.6792 1.2412 1.1919 1.8205 1.2338 1.1020 1.3859 1.3066 1.3660 1.3529 1.2876 1.4423 1.4723 1.4922 1.3154 1.7418 1.5303 1.6811 1.2176 2.3414 1.5897 1.6325 3.1632 1.0920 1.0873 1.0806 1.0511 1.0861 1.0922 1.1249 1.0924 1.1504 1.0698 1.0870 1.1722 1.1867 1.3878 1.0874 6.6868 6.0638 10.8008 1.0717 1.0700 1.0700 1.0557 1.0631 1.0360 1.0617 1.0611 1.0359 1.0601 1.1058 1.0624 1.0857 1.0895 1.0916 1.0882 1.0636 1.1034 1.1019 1.1036 1.1027 1.0991 1.0998 1.0973 1.1084 1.1032 1.0877 1.0935 1.0952 1.0911
irintensity: 0.3152 1.8063 0.0451 0.3928 0.1830 0.2176 0.7347 0.0735 1.1853 0.1221 0.1804 0.2870 4.1713 1.5004 1.7656 1.4025 0.3520 0.2748 1.2564 1.4387 0.8742 2.2774 4.6710 1.8754 7.7514 3.0875 11.2918 7.0725 7.1785 12.4601 2.8026 0.5030 3.5329 4.1958 0.9134 2.7003 6.4301 4.5087 0.2912 2.9407 33.0969 4.8662 12.4612 10.3668 0.6109 62.8934 1.7692 2.3716 0.0443 53.0705 4.6771 4.9001 1.4841 25.2855 16.7036 16.0701 1.9157 17.8576 4.1105 23.2982 0.9074 68.0760 60.6905 37.5430 136.8664 34.2190 18.2456 5.2599 20.3989 43.2594 31.1895 26.7815 408.3033 16.8583 15.3325 1.2415 6.0976 0.1934 4.7344 33.4118 69.7077 89.7557 36.7514 237.4703 0.4728 15.8139 1.8294 3.5509 138.9034 12.3659 0.1915 7.8678 4.7218 0.3167 12.7180 0.7207 0.7452 13.8298 13.8156 40.3884 104.4916 60.7718 77.2859 27.7359 0.4631 21.3155 45.9403 52.0250 7.0687 14.4947 0.8496 3.7984 5.4600 18.7329 31.4609 6.2232 31.0790 20.8436 11.8290 41.5418 76.0574 17.9955 24.8314 40.2389 176.1614 329.4851 44.5086 146.3492 98.1981 24.8221 39.9569 35.1423 31.7494 32.7249 24.5543 26.9960 20.4236 30.0637 49.2432 61.4373 32.1087 27.0982 21.3541 18.7696 0.9331 95.7715 83.0383 49.8939 24.5317 20.9218 32.0934 30.5107 14.9851 11.5833 11.6789 15.2564
temp: 298.150 k
press: 1.00000 atm
elementType: 8 8 8 7 7 6 6 6 6 6 6 6 6 6 6 6 6 6 6 6 6 6 6 6 1 1 1 1 1 1 1 1 1 1 1 1 1 1 1 1 1 1 1 1 1 1 1 1 1 1 1 1 1 1
symmnumber: 1
zpe: 1217725.0 jmol-1
zpe.correction: 0.463807 hartree
zpe.thermalcorrener: 0.488477 hartree
zpe.thermalcorrenthalpy: 0.489421 hartree
zpe.thermalcorrgfe: 0.407065 hartree
zpe.sumelectzpe: -1075.313826 hartree
zpe.sumelectthermal: -1075.289157 hartree
zpe.sumelectthermalent: -1075.288212 hartree
zpe.sumelectthermalfe: -1075.370568 hartree
dipole: 3.2101 -1.1793 1.1746
dipole: 3.6160
quadrupole: -139.9852 -130.6137 -147.8650
quadrupole: -2.3325 1.3541 0.6216
quadrupole: -0.4973 8.8743 -8.3770 -2.3325 1.3541 0.6216
hfenergy: -1075.7776333 hartree
pointgroup: C01 [X(C19H30N2O3)]
dipole: 1.2337331 0.5169012 -0.4843852 debye
polarizability: 308.8392967|0.5236161|257.8692258|1.0162504|-3.2970815|152.0044887 unknown
InChI: InChI=1S/C19H30N2O3/c1-3-14-23-18-10-8-9-17(16-18)21(4-2)19(22)24-15-13-20-11-6-5-7-12-20/h8-10,16H,3-7,11-15H2,1-2H3
charge 0 multiplicity 1
54 atoms
O  1.234324 1.106654 -0.007438
O  -0.279158 -0.596171 0.497609
O  -4.97702 -1.445326 0.150287
N  4.786003 -0.052696 0.162395
N  -1.019244 1.55573 -0.217785
C  6.03321 0.652444 0.556669
C  5.01048 -0.93499 -1.013042
C  7.150788 -0.353939 0.900825
C  6.095238 -1.99012 -0.718191
C  7.413363 -1.309772 -0.285057
C  3.635673 0.862697 -0.022762
C  2.322077 0.136477 0.2960
C  -0.071524 0.58928 0.122807
C  -2.442549 1.322534 -0.10751
C  -0.542768 2.898007 -0.669691
C  -2.974722 0.006211 -0.017611
C  -3.333868 2.430579 -0.116106
C  -0.269746 3.874774 0.49246
C  -4.373509 -0.182527 0.058162
C  -4.728356 2.212939 -0.045988
C  -5.265764 0.917287 0.040479
C  -4.101917 -2.633945 0.187354
C  -5.014102 -3.857546 0.301712
C  -4.200572 -5.169857 0.344722
H  5.810828 1.286616 1.435103
H  6.393389 1.330035 -0.263462
H  5.319945 -0.329972 -1.907569
H  4.060317 -1.436348 -1.272461
H  8.071454 0.198482 1.170736
H  6.837995 -0.940899 1.785978
H  5.736454 -2.653526 0.092123
H  6.254245 -2.613926 -1.618787
H  8.170188 -2.068604 -0.010612
H  7.827779 -0.733055 -1.138334
H  3.58409 1.284539 -1.056425
H  3.743221 1.717093 0.670123
H  2.176314 -0.768884 -0.318701
H  2.271411 -0.15394 1.358949
H  0.382635 2.748129 -1.245584
H  -1.3013 3.300983 -1.361337
H  -2.287884 -0.837692 0.014449
H  -2.966562 3.457741 -0.155206
H  0.041214 4.858078 0.093602
H  0.54408 3.490501 1.130324
H  -1.163852 4.023395 1.122302
H  -5.401724 3.077216 -0.050671
H  -6.34238 0.735812 0.099942
H  -3.492549 -2.676991 -0.739634
H  -3.414737 -2.56494 1.055866
H  -5.630709 -3.758915 1.214595
H  -5.710758 -3.865636 -0.557322
H  -3.59784 -5.300549 -0.573695
H  -3.508349 -5.185688 1.207377
H  -4.870453 -6.043282 0.434429
