program: Gaussian 09
title: 000005634
version: EM64L-G09RevD.01
frameworkgroup: C1[X(C11H20O2)]
method: RPBEPBE
basis: SDD
operation: Freq
keyword: #pfreq=noraman
keyword: PBEPBE/SDD
title: #p freq=noraman PBEPBE/SDD
converged: YES YES NO NO
title: Mulliken charges:
elementType: O O C C C C C C C C C C C H H H H H H H H H H H H H H H H H H H H
charge: -0.418059 -0.231049 -0.383212 -0.381675 -0.368501 -0.377686 -0.371592 -0.376278 -0.420714 -0.487802 -0.078885 0.170893 -0.570167 0.196048 0.195927 0.192654 0.192477 0.191487 0.191445 0.189082 0.189236 0.218450 0.217414 0.198485 0.198225 0.207441 0.207416 0.252379 0.252178 0.198693 0.206420 0.224148 0.375123
chargesum: 0.00000
title: Mulliken charges with hydrogens summed into heavy atoms:
elementType: O O C C C C C C C C C C C
charge: -0.042936 -0.231049 0.008763 0.003456 0.014431 0.000631 0.025118 0.059586 -0.005857 0.016755 0.119809 0.170893 -0.139599
polarizability: 1.62652540e+02 4.36564463e+00 1.23561242e+02 1.06408410e-01 6.49880927e-02 8.69765751e+01
1716.lowfreq: -0.0005 0.0004 0.0007 6.5870 8.0796 13.7144 23.3912 36.0326 39.2895
frequency: 19.6951 30.3191 39.1794 58.0886 65.3440 94.3764 106.1336 113.1490 147.1975 152.7862 169.7019 171.3258 179.8999 273.9942 325.5866 396.5779 445.6750 494.4939 501.1152 552.3488 564.0929 588.9911 636.0839 722.1778 727.1668 746.0383 784.9386 849.3209 857.0831 903.6864 920.6072 935.6022 974.4626 999.8292 1000.3758 1007.6931 1016.3425 1042.0461 1064.6816 1077.6823 1081.6266 1093.7282 1106.6288 1119.5698 1126.3875 1202.3826 1208.4825 1236.4987 1239.7071 1259.2370 1269.2076 1283.1050 1284.9828 1289.7317 1296.9292 1299.1665 1299.4932 1326.0586 1352.1330 1359.5326 1366.5202 1374.2164 1424.7920 1438.0399 1454.0588 1462.4152 1462.9804 1466.5984 1474.0415 1482.7036 1488.2743 1660.0545 1669.4606 2941.6921 2950.1108 2952.0607 2953.6968 2962.4941 2969.7712 2976.6352 2985.1569 2986.4405 2992.1820 2995.4909 3006.7407 3025.3641 3032.1114 3042.0675 3061.6664 3077.7390 3102.8684 3199.6833 3511.2109
redmass: 5.2965 4.0450 4.8471 1.9107 2.9817 4.5731 1.9003 2.2549 1.9075 2.0669 4.4770 1.6414 5.0726 3.9132 4.0562 3.8792 3.3019 3.3422 1.7897 1.2014 2.5927 4.6055 1.3264 1.0647 1.0995 1.1710 1.2730 1.3410 4.8572 3.3048 1.3102 1.3619 2.2433 2.6877 1.3959 1.0887 3.3505 2.5520 2.7259 2.4308 2.0954 2.3512 1.4888 1.3620 2.4449 1.5528 1.2827 1.3994 1.3319 1.4560 1.1833 1.0437 1.1067 1.4218 1.0999 1.1220 1.2472 1.4749 1.5655 1.7055 1.7331 1.8441 1.1921 1.0849 1.0787 1.0716 1.0734 1.0705 1.0942 1.0994 1.1007 4.4716 8.2246 1.0597 1.0589 1.0590 1.0594 1.0592 1.0587 1.0969 1.0970 1.0614 1.0996 1.0595 1.1028 1.1027 1.1012 1.1045 1.1031 1.0797 1.0721 1.1144 1.0639
irintensity: 0.9189 0.1586 0.3507 0.1630 0.1221 0.3211 0.0953 0.0012 0.0219 0.0003 0.5946 0.1239 1.8633 0.3089 2.5554 8.6661 0.6748 22.7101 30.1001 19.3274 1.7177 15.3827 127.7938 19.1722 0.2427 4.2861 2.8516 0.2048 1.3878 2.9598 27.8605 46.2728 1.6253 75.7813 19.1450 17.8464 20.9446 146.3823 1.7132 13.6816 4.6126 19.5330 1.0449 0.1123 9.1945 0.1200 33.8815 0.1487 0.0091 3.7931 0.0289 0.0110 0.6506 19.6565 0.0227 0.3226 2.7915 12.3682 12.8142 0.7170 0.8595 31.1983 2.9262 27.8914 15.4199 0.8457 0.0332 1.5897 2.4031 0.8560 26.2346 25.1862 208.3647 17.9393 6.4148 2.0469 0.9988 50.1993 110.3814 13.4252 0.8508 5.0329 1.1268 40.8381 2.6833 2.4184 0.5250 153.7825 91.7655 38.9091 9.8283 38.6602 17.7257
temp: 298.150 k
press: 1.00000 atm
elementType: 8 8 6 6 6 6 6 6 6 6 6 6 6 1 1 1 1 1 1 1 1 1 1 1 1 1 1 1 1 1 1 1 1
symmnumber: 1
zpe: 756278.1 jmol-1
zpe.correction: 0.288051 hartree
zpe.thermalcorrener: 0.304281 hartree
zpe.thermalcorrenthalpy: 0.305225 hartree
zpe.thermalcorrgfe: 0.241205 hartree
zpe.sumelectzpe: -580.547885 hartree
zpe.sumelectthermal: -580.531655 hartree
zpe.sumelectthermalent: -580.530711 hartree
zpe.sumelectthermalfe: -580.594732 hartree
dipole: -0.1931 -1.0126 0.0166
dipole: 1.0310
quadrupole: -82.5896 -85.7304 -81.4127
quadrupole: -9.5930 0.0544 0.1136
quadrupole: 0.6546 -2.4861 1.8315 -9.5930 0.0544 0.1136
hfenergy: -580.8359362 hartree
pointgroup: C01 [X(C11H20O2)]
dipole: -0.0776426 -0.3973694 0.0245014 debye
polarizability: 162.6887996|4.2006885|123.4560861|-0.0785326|-1.5865068|87.0454716 unknown
InChI: InChI=1S/C11H20O2/c1-2-3-4-5-6-7-8-9-10-11(12)13/h2,12H,1,3-10H2
charge 0 multiplicity 1
33 atoms
O  6.340119 -0.916952 0.059447
O  5.48467 1.236656 -0.072534
C  0.170232 0.449673 -0.013753
C  -1.181913 -0.297745 0.01028
C  1.390434 -0.4976 0.020863
C  -2.40405 0.647245 -0.022539
C  -3.753828 -0.104676 0.003211
C  2.738119 0.256054 -0.004787
C  -4.967146 0.846853 -0.028498
C  3.9410 -0.705225 0.032839
C  -6.33366 0.188039 -0.00373
C  5.279345 0.005573 -0.000692
C  -6.59051 -1.144222 0.044727
H  0.223344 1.082764 -0.923962
H  0.220793 1.144295 0.850536
H  -1.232832 -0.99178 -0.854807
H  -1.234352 -0.931749 0.920241
H  1.335312 -1.12977 0.932158
H  1.337041 -1.192636 -0.843518
H  -2.353111 1.341914 0.842158
H  -2.352747 1.280903 -0.932901
H  2.799807 0.88654 -0.912461
H  2.796339 0.95205 0.85403
H  -3.80521 -0.796627 -0.862079
H  -3.80455 -0.736417 0.913479
H  -4.904579 1.490527 -0.9331
H  -4.902286 1.551759 0.829077
H  3.917331 -1.339854 0.940679
H  3.912855 -1.4111 -0.82097
H  -7.18718 0.884397 -0.028281
H  -7.618093 -1.525153 0.059394
H  -5.790066 -1.892046 0.071057
H  7.203274 -0.420789 0.033138
