program: Gaussian 09
title: 000005749
version: EM64L-G09RevD.01
frameworkgroup: C1[X(C21H34NO3)]
method: RPBEPBE
basis: SDD
operation: Freq
keyword: #p
keyword: freq=noraman
keyword: PBEPBE/SDD
title: #p freq=noraman PBEPBE/SDD
converged: NO YES NO NO
title: Mulliken charges:
elementType: O O O N C C C C C C C C C C C C C C C C C C C C C H H H H H H H H H H H H H H H H H H H H H H H H H H H H H H H H H H
charge: -0.455098 -0.244105 -0.246841 -0.119168 -0.040495 -0.447269 -0.440871 0.026067 -0.410771 -0.412871 -0.388537 0.353616 -0.350900 0.153455 -0.292256 -0.288665 -0.327830 -0.562465 -0.371202 -0.398976 -0.698723 -0.717995 -0.236500 -0.219129 -0.234978 0.225211 0.248689 0.157546 0.223217 0.232517 0.185745 0.201586 0.214636 0.190865 0.201275 0.210541 0.313491 0.278314 0.262001 0.258299 0.250694 0.253393 0.261554 0.250695 0.261673 0.268069 0.270697 0.367972 0.240943 0.270877 0.273072 0.242760 0.246996 0.294309 0.231227 0.268406 0.232856 0.239984 0.242398
chargesum: 1.00000
title: Mulliken charges with hydrogens summed into heavy atoms:
elementType: O O O N C C C C C C C C C C C C C C C C C C C C C
charge: -0.087126 -0.244105 -0.246841 -0.119168 0.184716 -0.041033 0.014864 0.026067 -0.023440 -0.007370 0.023279 0.353616 0.240905 0.153455 0.228043 0.215422 0.184420 0.237974 -0.130260 -0.128100 0.064105 0.075948 -0.003644 0.020854 0.007420
polarizability: 2.64377815e+02 2.49576331e+01 2.31496938e+02 2.44016812e+00 -4.50684808e+00 2.17148621e+02
1716.lowfreq: -10.7377 -3.8657 -0.0005 0.0005 0.0006 6.1164 17.4904 24.3144 37.2847
frequency: 17.2618 23.5075 37.1446 37.5762 57.0681 59.7240 74.2812 77.5273 97.3007 106.1719 118.1815 136.6029 144.0940 188.5086 203.8441 217.2209 218.8963 229.0999 237.0888 258.8685 264.3014 266.2739 290.8177 298.7214 316.0677 327.4271 340.3673 344.3049 346.7201 379.8568 385.1704 391.6506 405.6805 421.8079 425.7675 433.0302 480.9109 495.7765 501.9862 517.9038 538.4087 600.6444 614.6082 679.6855 691.6555 704.2354 714.1653 741.8995 765.4731 770.5637 789.9125 791.3666 802.5290 807.2069 836.4737 850.8062 858.0815 871.9325 881.4116 900.7302 909.8880 920.6657 931.3676 940.7024 951.6101 968.1318 983.2667 986.8290 989.8903 996.5413 1007.0957 1028.1752 1037.8136 1049.9025 1055.2979 1058.2714 1060.4308 1070.0112 1076.5163 1079.9670 1087.0009 1113.8812 1116.0053 1123.1865 1144.0486 1149.0068 1159.8304 1167.5494 1176.9521 1178.6791 1191.0398 1196.8981 1207.7828 1241.3141 1257.3964 1261.6590 1264.2957 1273.0468 1292.3882 1301.1768 1311.2279 1313.0212 1315.6132 1327.2101 1329.7663 1336.4797 1336.6649 1342.0849 1343.4232 1344.6875 1360.6135 1379.9351 1380.3724 1394.3380 1411.3642 1419.1257 1433.7510 1435.6439 1454.1287 1460.5879 1461.2890 1464.6939 1465.5843 1466.9281 1471.1833 1474.0492 1475.8940 1477.1703 1479.4067 1481.0210 1487.0314 1490.8350 1500.7888 1506.1541 1589.7240 1599.2774 1608.8074 2941.6647 2962.9518 2967.9086 2977.1975 2983.0278 2995.4737 2999.3784 3004.6474 3023.3349 3024.3840 3029.2928 3032.8008 3035.3173 3038.4030 3041.2212 3046.7017 3057.4157 3060.7016 3083.5271 3088.3142 3090.0770 3094.9946 3110.1423 3111.5469 3114.9209 3129.4503 3130.8205 3139.1883 3147.1673 3149.8423 3155.7858 3162.2731 3173.5087 3518.3497
redmass: 4.4647 3.4329 3.9252 3.8789 3.2287 3.9318 2.7770 3.7087 3.8293 3.0339 3.2359 1.9863 2.9643 2.9147 1.1269 2.9767 3.4328 1.8810 2.0348 2.8408 2.8302 2.2602 2.8860 1.3698 1.4892 3.3472 2.5391 2.2832 2.5455 2.6928 3.1900 4.0328 2.6711 3.3234 2.9484 3.0550 2.1834 3.0348 2.4532 2.3545 3.9655 5.6526 6.4249 5.3548 4.1046 2.4678 2.2087 2.6885 1.7538 1.8472 1.4473 1.3181 1.3061 3.0051 1.7588 1.8068 1.2614 3.9211 2.1805 1.4685 2.4642 2.8947 1.4919 2.4277 3.2905 2.5358 1.6784 3.5478 3.4734 2.0104 1.3427 2.1945 2.2077 2.3085 1.7722 1.7795 2.0804 1.8334 1.4568 1.4736 1.7427 2.6530 2.1164 3.0549 1.6507 2.5676 2.0698 2.8657 1.0802 1.6795 1.1698 1.6677 1.8241 1.3792 1.3033 1.2657 1.2540 1.0971 1.2555 1.2585 1.1095 1.3765 1.4012 1.4096 1.2280 1.3310 1.2697 1.3819 1.3240 1.4763 1.4641 1.4763 4.5835 1.3042 1.2068 1.1856 2.1808 1.1610 1.0926 1.0771 1.0876 1.0603 1.0865 1.0877 1.0860 2.0736 1.0728 1.0507 1.0936 1.0451 1.0527 1.0681 1.0703 1.0566 6.1918 7.6219 7.3138 1.0648 1.0645 1.0655 1.0622 1.0807 1.0611 1.0377 1.0379 1.0960 1.0601 1.0586 1.0352 1.0592 1.0945 1.0972 1.1013 1.0594 1.1028 1.1058 1.1038 1.0982 1.0976 1.1052 1.1041 1.1035 1.0856 1.1074 1.0878 1.1044 1.0934 1.1040 1.0952 1.1000 1.0653
irintensity: 2.4023 0.3234 0.2260 0.6826 0.0769 0.9138 0.9968 1.3835 2.4954 1.4413 0.3188 2.0518 1.6880 1.5091 0.5984 0.9972 0.8745 0.2943 0.7511 1.8506 2.9778 23.5387 30.1974 0.3393 91.0595 11.4254 2.4655 5.8738 1.6042 32.4770 0.6128 6.6550 7.0537 0.1579 8.2354 0.3401 0.5866 2.4018 6.1009 0.7767 3.0757 19.0869 0.2456 13.8371 6.0038 14.8128 62.6592 8.8379 15.1178 36.0170 0.3273 7.4378 42.6875 2.0300 6.2457 8.2926 0.3847 9.3029 0.7915 12.0909 12.2825 1.4518 3.9623 0.6553 5.9980 15.2901 18.4783 31.4227 24.1300 38.1846 3.0958 5.8625 20.9917 56.6262 63.0908 3.3193 35.9671 1.4124 1.4864 19.3166 32.9686 13.9778 39.2841 89.0260 0.4931 9.4960 8.4668 15.7236 0.4077 1.8717 1.1211 4.0391 1.3738 1.7122 0.1368 1.9876 2.4753 0.5426 4.7990 1.4222 0.4789 18.5821 28.3918 2.0601 3.4473 4.1035 18.7832 6.9635 1.2156 0.2376 2.3694 1.1865 0.1762 1.0805 18.0735 39.8907 11.2643 12.6808 17.4001 4.2938 1.2876 32.1635 6.6889 9.2440 16.9255 18.7463 5.9678 21.2893 2.9495 2.0158 8.2121 20.1221 74.9727 5.5877 3.1820 91.2116 70.5295 97.2433 63.9043 27.5144 31.5313 8.4164 14.8492 13.5097 2.9610 53.3725 3.3040 4.6737 2.8560 39.3222 57.3368 9.9850 47.4306 4.6896 53.7138 2.5468 2.3734 7.1374 7.9256 0.8274 5.9774 29.4568 2.9360 3.9137 2.0364 5.2561 17.5203 2.9780 12.2231 15.7382 22.7843
temp: 298.150 k
press: 1.00000 atm
elementType: 8 8 8 7 6 6 6 6 6 6 6 6 6 6 6 6 6 6 6 6 6 6 6 6 6 1 1 1 1 1 1 1 1 1 1 1 1 1 1 1 1 1 1 1 1 1 1 1 1 1 1 1 1 1 1 1 1 1 1
symmnumber: 1
zpe: 1357423.1 jmol-1
zpe.correction: 0.517015 hartree
zpe.thermalcorrener: 0.543716 hartree
zpe.thermalcorrenthalpy: 0.544660 hartree
zpe.thermalcorrgfe: 0.459338 hartree
zpe.sumelectzpe: -1098.853918 hartree
zpe.sumelectthermal: -1098.827217 hartree
zpe.sumelectthermalent: -1098.826273 hartree
zpe.sumelectthermalfe: -1098.911595 hartree
dipole: 17.7546 -1.3317 2.2010
dipole: 17.9400
quadrupole: -47.8448 -135.4914 -136.5444
quadrupole: 3.9405 3.6360 -0.3894
quadrupole: 58.7820 -28.8645 -29.9175 3.9405 3.6360 -0.3894
hfenergy: -1099.3709329 hartree
pointgroup: C01 [X(C21H34N1O3)]
dipole: -6.9630418 -0.8942414 -0.730445 debye
polarizability: 264.05203|-21.2551083|232.055325|13.9724662|-3.0461004|216.9160188 unknown
InChI: InChI=1S/C21H34NO3/c1-4-22(3,5-2)16-17-25-20(23)21(24,18-12-8-6-9-13-18)19-14-10-7-11-15-19/h6,8-9,12-13,19,24H,4-5,7,10-11,14-17H2,1-3H3
charge 1 multiplicity 1
59 atoms
O  1.744625 1.066616 1.890491
O  -0.625971 -0.513089 -0.418073
O  -0.707953 -0.124993 1.870316
N  -4.427318 -0.022466 -0.116213
C  1.695246 1.231924 -0.533156
C  0.795466 2.492924 -0.485267
C  3.190216 1.635536 -0.613074
C  1.434611 0.291937 0.691523
C  1.054231 3.420581 -1.697252
C  3.448947 2.563659 -1.824484
C  2.546325 3.817757 -1.786258
C  2.265433 -1.019256 0.629626
C  -2.92634 0.262526 -0.304129
C  -0.048996 -0.116817 0.802395
C  -4.983303 -0.943411 -1.240174
C  -4.71505 -0.740524 1.242238
C  -2.026647 -0.989669 -0.32571
C  -5.162075 1.316122 -0.138257
C  2.103224 -1.946425 -0.431994
C  3.231303 -1.276131 1.631834
C  -4.786439 -0.435062 -2.671909
C  -4.109288 -0.078916 2.483949
C  2.89457 -3.114782 -0.483848
C  4.019073 -2.448059 1.579486
C  3.852636 -3.372716 0.524177
H  1.44294 0.648372 -1.442464
H  1.004318 3.03811 0.454393
H  -0.277849 2.20303 -0.462998
H  3.82436 0.732826 -0.688077
H  3.470564 2.153368 0.323936
H  0.7608 2.899772 -2.633277
H  0.420895 4.325659 -1.619729
H  4.514569 2.860232 -1.840343
H  3.260355 2.005352 -2.765325
H  2.813304 4.434378 -0.904105
H  2.721484 4.443903 -2.681513
H  -2.621904 0.915048 0.528337
H  -2.816903 0.824019 -1.245613
H  -4.496692 -1.923724 -1.101133
H  -6.056556 -1.067514 -1.012103
H  -5.816413 -0.788391 1.309683
H  -4.338914 -1.771301 1.128611
H  -2.163955 -1.604459 -1.228011
H  -2.141469 -1.599439 0.587138
H  -6.244393 1.133985 -0.050446
H  -4.945806 1.838756 -1.080719
H  -4.817193 1.931018 0.704974
H  1.248669 0.685167 2.662745
H  1.367634 -1.758248 -1.221867
H  3.383583 -0.54297 2.429225
H  -5.231878 -1.180885 -3.353829
H  -3.725209 -0.338218 -2.956306
H  -5.299661 0.520563 -2.868556
H  -3.00636 -0.08319 2.48199
H  -4.473714 0.948901 2.650943
H  -4.432128 -0.671172 3.359053
H  2.767596 -3.821287 -1.311523
H  4.767857 -2.632252 2.3574
H  4.465643 -4.279375 0.483073
