program: Gaussian 09
title: 000005656
version: EM64L-G09RevD.01
frameworkgroup: C1[X(C17H27NO2)]
method: RPBEPBE
basis: SDD
operation: Freq
keyword: #p
keyword: freq=noraman
keyword: PBEPBE/SDD
title: #p freq=noraman PBEPBE/SDD
converged: YES YES NO NO
title: Mulliken charges:
elementType: O O N C C C C C C C C C C C C C C C C C H H H H H H H H H H H H H H H H H H H H H H H H H H H
charge: -0.478219 -0.269209 -0.072632 0.291661 -0.227733 -0.487702 -0.516465 -0.408051 -0.388945 -0.391745 -0.468796 0.570868 -0.446479 -0.422985 -0.620243 -0.623995 -0.363298 -0.375347 0.309515 -0.537910 0.199624 0.247954 0.201049 0.203814 0.200662 0.221101 0.190821 0.191134 0.203682 0.184985 0.202943 0.178404 0.243208 0.332303 0.224072 0.273923 0.235668 0.182423 0.220632 0.226911 0.185006 0.220526 0.243660 0.234534 0.218100 0.241830 0.218742
chargesum: 0.00000
title: Mulliken charges with hydrogens summed into heavy atoms:
elementType: O O N C C C C C C C C C C C C C C C C C
charge: -0.145917 -0.269209 -0.072632 0.291661 -0.028109 -0.038699 -0.111989 0.003871 0.005870 -0.003817 -0.047185 0.570868 -0.222406 -0.149061 0.018480 0.008448 -0.119637 -0.140812 0.309515 0.140762
polarizability: 2.42876351e+02 1.41700393e+01 1.81666367e+02 4.23214407e-01 8.15137866e+00 1.65723663e+02
1716.lowfreq: -9.4772 -5.2372 -0.0007 -0.0004 0.0003 5.0192 25.0319 32.1035 47.2090
frequency: 24.4606 31.8800 47.1987 53.9349 61.7792 77.1239 102.0392 138.1129 160.2505 172.1817 199.3920 207.4648 221.2891 227.4244 238.5746 242.3799 257.0749 276.8580 289.8451 308.5848 325.5539 345.4912 388.1127 391.6771 407.8960 416.4587 428.1140 448.3639 475.3757 482.4247 500.9946 535.1029 566.7357 628.8091 648.0070 712.8409 726.5186 760.8124 772.0996 796.5276 816.4594 820.7377 829.0125 838.3713 851.5410 902.5384 916.8708 924.2172 945.3570 952.6193 967.9046 973.8814 991.8770 1006.1950 1018.1856 1034.7741 1047.2370 1054.6347 1060.2633 1079.2934 1088.9195 1093.2029 1107.7704 1112.0820 1116.6553 1130.0957 1143.8264 1155.7538 1161.2251 1168.7743 1179.7020 1203.1848 1225.6997 1233.9651 1251.7118 1263.1292 1267.7184 1272.9591 1294.3492 1305.1375 1312.2248 1324.4860 1333.6165 1340.0970 1343.2827 1344.5882 1358.9146 1367.9421 1384.9829 1416.8816 1419.5516 1435.4983 1439.1420 1450.1479 1457.0752 1458.2667 1461.1040 1464.4167 1465.3924 1467.0070 1473.5427 1473.8038 1474.7700 1476.4708 1483.7372 1500.2578 1583.4891 1621.0439 2815.5330 2834.3319 2851.7236 2953.6354 2957.7107 2959.8452 2979.3273 2980.3336 2986.4196 2988.1568 3014.1397 3018.3929 3020.6613 3026.5946 3036.2745 3038.8448 3039.4892 3050.3066 3069.0740 3076.5955 3081.6614 3119.6125 3123.4750 3129.6542 3155.6844 3162.8844 3544.5390
redmass: 3.2464 4.1956 3.2009 2.7442 3.3101 3.3743 3.5764 3.3379 3.3397 3.2502 2.1804 1.5342 1.8665 1.1028 1.8182 2.6258 2.8981 2.5744 4.1051 1.7268 1.2436 3.4439 2.7024 2.0765 2.0931 2.9751 2.4376 3.3477 2.2681 2.7408 2.8769 3.5076 2.6911 6.0918 3.1316 3.7161 4.0137 3.5316 1.6465 4.5213 2.9189 1.3078 2.3912 2.0748 1.6950 2.3452 2.2623 1.6016 1.8321 1.5127 1.3570 2.5283 7.3462 2.5017 2.6189 1.5356 2.0229 1.9730 1.8419 2.0483 1.2937 1.4725 1.3674 1.2615 1.5504 1.4021 2.5243 1.3561 1.4595 1.6625 1.2820 1.7870 3.1057 1.3787 1.3842 1.5569 1.7261 1.7827 1.3918 1.3584 1.4025 1.5992 1.5546 1.4386 1.4545 1.6070 1.3647 1.4791 3.9086 2.7052 1.1774 1.1743 1.1533 1.0877 1.0893 1.0899 1.0521 1.0504 1.0697 1.0811 1.0827 1.0826 1.0616 1.0875 1.0540 2.3995 7.1330 6.3807 1.0690 1.0580 1.0586 1.0331 1.0595 1.0629 1.0650 1.0670 1.0761 1.0653 1.0984 1.0713 1.0708 1.0956 1.0874 1.1036 1.1028 1.1007 1.0958 1.1007 1.1005 1.0989 1.0892 1.0887 1.0943 1.0953 1.0655
irintensity: 0.0785 0.1439 2.0632 0.8788 0.8276 0.6819 3.6060 3.9799 1.2587 1.2780 1.4418 1.1600 0.1105 0.1644 0.4593 1.3041 0.1479 4.3899 2.2262 47.5653 131.2637 1.6355 5.4548 0.8828 0.5062 0.6754 1.0626 3.3629 3.3260 7.7250 9.1222 13.1192 19.6154 2.6618 5.4986 9.9263 4.9861 22.8611 5.3436 3.2469 11.5561 7.8169 40.7155 14.8505 13.4659 22.8421 6.9848 5.6564 10.0857 4.1626 1.2060 28.5596 29.7991 8.5505 11.8008 20.3279 44.9561 8.9744 3.3103 10.8810 4.6191 2.8388 8.8499 0.2722 14.8407 8.3546 16.0112 0.5004 5.4596 26.7281 74.4907 11.6655 148.4942 8.0928 12.1687 8.9472 3.8772 2.5514 15.3714 6.4151 9.7018 6.3416 8.1448 3.2025 0.8074 6.3845 5.9765 19.7975 6.1333 0.5207 3.2501 9.5626 1.9837 5.4077 8.8474 4.2767 15.4198 12.1608 6.3679 15.6019 49.3338 16.2236 19.0258 15.7632 9.1955 122.9233 5.4518 44.0476 108.0818 77.0201 280.9909 72.8605 32.1464 40.2469 46.7653 5.6097 44.6019 20.6429 38.4477 32.8203 49.0496 75.4833 15.1813 52.1397 36.3423 63.9231 26.9363 26.4138 51.3146 31.8484 15.9237 3.7573 14.9221 8.2028 1.6063
temp: 298.150 k
press: 1.00000 atm
elementType: 8 8 7 6 6 6 6 6 6 6 6 6 6 6 6 6 6 6 6 6 1 1 1 1 1 1 1 1 1 1 1 1 1 1 1 1 1 1 1 1 1 1 1 1 1 1 1
symmnumber: 1
zpe: 1070958.2 jmol-1
zpe.correction: 0.407906 hartree
zpe.thermalcorrener: 0.429165 hartree
zpe.thermalcorrenthalpy: 0.430109 hartree
zpe.thermalcorrgfe: 0.357452 hartree
zpe.sumelectzpe: -867.602434 hartree
zpe.sumelectthermal: -867.581176 hartree
zpe.sumelectthermalent: -867.580232 hartree
zpe.sumelectthermalfe: -867.652889 hartree
dipole: 1.3059 1.2865 -1.1517
dipole: 2.1649
quadrupole: -115.3128 -118.8619 -118.2508
quadrupole: 8.4567 8.9913 0.4414
quadrupole: 2.1624 -1.3867 -0.7757 8.4567 8.9913 0.4414
hfenergy: -868.0103406 hartree
pointgroup: C01 [X(C17H27N1O2)]
dipole: -0.4931455 -0.5547586 -0.4177689 debye
polarizability: 240.9563969|17.3994253|182.7530198|-2.4226133|-9.3182488|166.5569642 unknown
InChI: InChI=1S/C17H27NO2/c1-18(2)13-16(17(19)11-5-4-6-12-17)14-7-9-15(20-3)10-8-14/h7-10,16,19H,4-6,11-13H2,1-3H3
charge 0 multiplicity 1
47 atoms
O  -1.871973 0.47071 -1.685524
O  4.68319 1.309184 0.27017
N  -0.152337 -3.137692 0.125219
C  -1.874426 0.324034 -0.196737
C  -0.74823 -0.686035 0.248492
C  -1.62215 1.750971 0.343842
C  -3.272994 -0.176215 0.272054
C  -2.768292 2.733428 0.012776
C  -4.413139 0.805342 -0.085659
C  -4.137039 2.208233 0.501248
C  -0.800733 -2.01002 -0.57938
C  0.672578 -0.122601 0.220197
C  1.499074 -0.194281 1.371287
C  1.225847 0.444998 -0.954761
C  0.423142 -4.144567 -0.786283
C  -1.007096 -3.746366 1.160111
C  2.822415 0.285966 1.361198
C  2.550455 0.936698 -0.986214
C  3.35316 0.855893 0.178907
C  5.273272 1.903825 -0.928937
H  -0.977095 -0.942438 1.302882
H  -0.670973 2.127624 -0.069158
H  -1.486035 1.679704 1.442526
H  -3.241295 -0.305318 1.373429
H  -3.485024 -1.177135 -0.155975
H  -2.804929 2.876402 -1.083896
H  -2.54875 3.719451 0.466439
H  -5.376019 0.406178 0.288591
H  -4.498115 0.885566 -1.18752
H  -4.138713 2.14891 1.610277
H  -4.944165 2.910039 0.214964
H  -1.860015 -2.269996 -0.846131
H  -0.26048 -1.843856 -1.528901
H  -2.243344 -0.360709 -2.07827
H  1.10277 -0.645666 2.28885
H  0.598053 0.528065 -1.849403
H  1.13716 -3.657058 -1.472651
H  -0.341322 -4.686043 -1.401973
H  0.977395 -4.899535 -0.199462
H  -0.42698 -4.494024 1.730149
H  -1.912255 -4.257863 0.739178
H  -1.355792 -2.977997 1.872323
H  3.46041 0.226574 2.248422
H  2.937981 1.377154 -1.910285
H  5.310597 1.177518 -1.764885
H  6.296102 2.185911 -0.637908
H  4.715412 2.805538 -1.250519
