program: Gaussian 09
title: 000040215
version: EM64L-G09RevD.01
frameworkgroup: C1[X(C19H29NO3)]
method: RPBEPBE
basis: SDD
operation: Freq
keyword: #p
keyword: freq=noraman
keyword: PBEPBE/SDD
title: #p freq=noraman PBEPBE/SDD
converged: YES YES NO NO
title: Mulliken charges:
elementType: O O O N C C C C C C C C C C C C C C C C C C C H H H H H H H H H H H H H H H H H H H H H H H H H H H H H
charge: -0.291216 -0.269362 -0.236886 -0.076343 -0.354309 -0.367717 -0.395105 -0.386142 -0.398857 -0.373448 -0.272530 0.012287 0.454032 -0.232356 0.060559 -0.404284 0.361834 -0.700488 -0.703784 -0.481742 -0.818195 0.119442 -0.504750 0.165837 0.209572 0.212890 0.167416 0.190109 0.206296 0.203756 0.192259 0.188757 0.214738 0.203462 0.214545 0.231039 0.210147 0.246040 0.233200 0.211722 0.215145 0.223206 0.205459 0.212644 0.233201 0.233435 0.227445 0.221411 0.266778 0.246076 0.229811 0.242964
chargesum: 0.00000
title: Mulliken charges with hydrogens summed into heavy atoms:
elementType: O O O N C C C C C C C C C C C C C C C C C C C
charge: -0.291216 -0.269362 -0.236886 -0.076343 0.021100 0.012589 0.001299 0.009873 0.004638 0.044560 0.168656 0.012287 0.454032 0.013685 0.060559 -0.171083 0.361834 -0.050415 -0.052481 -0.248308 -0.102561 0.119442 0.214101
polarizability: 2.69079613e+02 1.06447929e+00 2.48032244e+02 -1.23943351e+01 5.96530008e-01 1.62773767e+02
1716.lowfreq: -18.8283 -6.8994 -3.2238 -0.0011 -0.0010 -0.0009 8.0765 18.9105 26.2140
frequency: -13.5497 18.6536 25.8122 33.5353 49.4341 57.3289 72.9397 88.2166 97.4265 113.4873 119.4394 128.5487 153.5542 162.6921 179.8487 192.8387 210.6276 214.3566 226.1578 233.0074 239.7774 261.1148 265.2907 279.9281 297.7420 318.1234 364.2726 375.2662 382.1275 397.7759 409.7185 438.5350 447.4744 450.8925 487.3241 515.4616 558.7158 587.6033 604.7867 650.3931 692.9269 715.3893 731.4014 762.1463 794.3203 797.7039 806.8654 819.1086 833.1364 850.4555 854.4676 891.5966 894.7482 906.2043 922.4654 941.8631 954.2086 957.3276 958.5462 973.7223 995.1688 1037.8814 1046.0633 1048.0741 1050.3049 1057.7276 1075.0939 1086.2871 1100.9329 1109.5467 1113.7610 1115.8925 1124.6399 1146.9976 1149.4400 1160.1737 1163.5628 1172.8333 1179.6382 1223.8650 1246.3927 1257.8623 1258.4054 1261.8810 1265.2052 1284.4076 1293.1805 1304.0311 1320.4734 1329.8509 1331.3718 1338.3657 1345.8284 1352.3186 1364.1898 1372.4760 1377.9643 1390.1209 1396.5855 1403.6510 1405.7710 1421.1674 1449.3486 1449.6557 1458.7740 1460.7446 1462.2479 1462.9683 1464.9393 1465.8058 1466.8684 1468.1829 1471.6805 1476.2509 1477.7449 1479.1048 1483.6927 1486.9936 1576.1562 1600.7188 1622.5273 2807.5560 2824.5295 2895.2714 2964.9146 2972.1117 2975.7698 2984.3401 2985.1844 2986.4679 2990.0643 3003.0788 3021.5593 3025.3155 3028.4049 3033.3494 3036.0279 3045.0308 3054.1186 3064.6243 3067.2871 3069.0030 3072.2958 3074.4243 3082.4642 3093.4049 3105.7741 3118.8128 3143.5597 3143.6236
redmass: 2.8215 4.1374 3.9298 3.1737 4.8156 3.2859 3.5733 2.8829 2.8783 1.4540 1.9115 1.1783 3.8459 2.3355 3.3208 1.2705 2.2393 1.9586 2.1696 2.0901 1.7694 3.3383 3.1089 4.5010 3.7073 2.4331 2.8903 2.7931 4.4278 2.5378 2.8175 3.5390 3.1497 3.5938 3.7806 3.0239 2.3297 3.4570 4.2963 4.4361 4.6542 5.8470 6.1009 3.6777 3.0425 1.5620 1.3096 4.2279 1.5430 1.5169 2.4956 5.2946 3.2593 2.3698 1.2000 4.7586 1.4760 1.2996 1.3461 2.4483 2.4763 2.2722 2.0183 1.5768 1.8767 1.9723 2.7052 2.8662 1.5225 1.2711 2.4950 2.1936 2.1841 1.4529 1.3083 2.3682 2.0072 1.1986 1.3509 5.8582 1.7497 1.5602 1.8306 2.0839 1.1832 1.2131 1.3815 1.9757 1.4083 1.3836 1.3312 1.4226 1.5180 1.5019 3.0660 1.5006 1.1998 1.7610 1.2128 1.3332 1.6014 1.2948 1.0913 1.0526 1.0873 1.0830 1.0768 1.0579 1.0884 1.0536 1.0512 2.2201 1.0765 1.1164 1.0714 1.0862 1.0921 1.2007 5.7748 7.5280 9.9089 1.0712 1.0700 1.0691 1.0628 1.0349 1.0354 1.0612 1.0612 1.0375 1.0574 1.0290 1.0844 1.0877 1.0905 1.0926 1.0907 1.1033 1.1036 1.0999 1.1051 1.0963 1.1002 1.0985 1.0996 1.1002 1.1046 1.0869 1.1027 1.0986
irintensity: 0.2320 0.0573 0.2055 0.3197 2.0895 0.4867 0.1536 1.1105 1.8493 0.9990 0.5087 0.7254 3.5939 3.8092 1.6095 0.1284 3.4058 0.2269 0.9350 2.7085 1.9189 2.9957 0.9463 1.9550 15.6032 0.9505 0.2967 5.5291 2.1418 5.3028 1.7261 1.4946 1.0640 3.2191 2.7113 3.2109 3.2112 1.8716 7.1694 14.0435 9.2124 4.2547 3.8688 7.2750 6.8222 0.6095 0.5947 14.0721 20.4593 4.1290 5.9591 4.4576 13.7022 5.6881 1.4937 26.9830 0.1415 2.8918 0.3670 71.7976 23.9938 120.3428 34.9018 6.2483 15.6405 48.2871 52.7411 3.1501 10.1728 0.4663 4.4938 23.0885 4.7737 20.8857 4.5826 36.7175 8.9050 10.1846 5.2664 272.8980 6.4497 3.9947 2.5780 14.5677 4.5045 9.1481 12.8130 66.8361 2.6917 6.3614 2.8893 0.3806 2.2530 1.1588 0.6515 2.7916 17.5066 10.6966 18.0560 17.2954 5.3176 25.3799 4.6582 19.7539 13.4417 9.0852 34.7841 4.4717 11.8135 3.3207 5.4042 32.8740 1.4802 31.6544 2.6630 2.5419 12.5165 32.4240 27.5077 9.9651 222.8241 62.9485 139.4694 84.9704 39.8934 30.6231 38.9212 32.2269 33.7820 26.3182 45.4933 33.8358 1.5966 44.0854 70.5519 32.0777 14.3324 19.7710 96.1454 2.9496 42.7537 16.9431 36.2853 87.8069 34.2247 17.9560 22.5499 11.6160 29.8681 16.2326
temp: 298.150 k
press: 1.00000 atm
elementType: 8 8 8 7 6 6 6 6 6 6 6 6 6 6 6 6 6 6 6 6 6 6 6 1 1 1 1 1 1 1 1 1 1 1 1 1 1 1 1 1 1 1 1 1 1 1 1 1 1 1 1 1
symmnumber: 1
zpe: 1167561.2 jmol-1
zpe.correction: 0.444701 hartree
zpe.thermalcorrener: 0.469140 hartree
zpe.thermalcorrenthalpy: 0.470084 hartree
zpe.thermalcorrgfe: 0.389307 hartree
zpe.sumelectzpe: -1020.036905 hartree
zpe.sumelectthermal: -1020.012465 hartree
zpe.sumelectthermalent: -1020.011521 hartree
zpe.sumelectthermalfe: -1020.092299 hartree
dipole: 2.1109 0.6493 1.6677
dipole: 2.7674
quadrupole: -129.1100 -132.9544 -144.2140
quadrupole: -9.1026 -8.9971 -5.0312
quadrupole: 6.3161 2.4717 -8.7878 -9.1026 -8.9971 -5.0312
hfenergy: -1020.4816056 hartree
pointgroup: C01 [X(C19H29N1O3)]
dipole: -0.7866991 -0.3851934 0.6466593 debye
polarizability: 268.9123191|2.781437|248.1695571|11.0097151|5.6755348|162.8037482 unknown
InChI: InChI=1S/C19H29NO3/c1-14(2)16-9-8-15(3)17(19(21)22-4)18(16)23-13-12-20-10-6-5-7-11-20/h8-9,14H,5-7,10-13H2,1-4H3
charge 0 multiplicity 1
52 atoms
O  0.439952 -0.171023 -0.878342
O  0.071953 2.437647 0.286419
O  1.753036 3.456223 -0.94894
N  -3.192932 -0.674884 -0.109244
C  -3.667827 0.494819 0.672792
C  -4.285035 -1.258392 -0.92938
C  -4.825669 0.102409 1.612939
C  -5.458875 -1.713543 -0.039156
C  -5.985533 -0.538136 0.815971
C  -1.967307 -0.384575 -0.889673
C  -0.717958 -0.508071 -0.00784
C  1.685149 -0.041536 -0.212884
C  2.473291 -1.197467 0.039109
C  1.992076 -2.599421 -0.342715
C  2.169328 1.266908 0.074696
C  3.744517 -0.998763 0.628896
C  3.469582 1.448462 0.634115
C  1.759644 -3.481414 0.913636
C  2.978173 -3.287766 -1.323867
C  4.230193 0.291144 0.924185
C  4.036418 2.82643 0.927518
C  1.355146 2.475705 -0.275337
C  -0.801546 3.585518 -0.060966
H  -4.012658 1.316239 -0.013742
H  -2.82307 0.896157 1.262242
H  -3.876807 -2.120642 -1.48852
H  -4.666899 -0.520177 -1.68491
H  -5.176332 0.998976 2.159992
H  -4.445469 -0.620448 2.360348
H  -5.105356 -2.525661 0.625337
H  -6.265452 -2.12596 -0.675687
H  -6.439665 0.225542 0.150211
H  -6.782764 -0.883076 1.50134
H  -1.981029 0.63103 -1.35374
H  -1.885386 -1.114593 -1.715854
H  -0.742848 0.200761 0.838818
H  -0.62227 -1.542023 0.37676
H  1.02967 -2.486313 -0.8743
H  4.375239 -1.86905 0.845647
H  2.70223 -3.632292 1.47263
H  1.375615 -4.477022 0.623074
H  1.031416 -3.017742 1.603988
H  3.9675 -3.450699 -0.856841
H  2.586053 -4.275154 -1.631366
H  3.127055 -2.676206 -2.231525
H  5.222324 0.408546 1.374515
H  3.361757 3.420895 1.571337
H  5.010428 2.743954 1.438385
H  4.171711 3.404392 -0.003303
H  -0.920531 3.656523 -1.155106
H  -1.760141 3.366878 0.430815
H  -0.364496 4.525187 0.31662
