program: Gaussian 09
title: 000005743
version: EM64L-G09RevD.01
frameworkgroup: C1[X(C22H29FO5)]
method: RPBEPBE
basis: SDD
operation: Freq
keyword: #p
keyword: freq=noraman
keyword: PBEPBE/SDD
title: #p freq=noraman PBEPBE/SDD
converged: YES YES NO NO
title: Mulliken charges:
elementType: F O O O O O C C C C C C C C C C C C C C C C C C C C C C H H H H H H H H H H H H H H H H H H H H H H H H H H H H H
charge: -0.219329 -0.451251 -0.439629 -0.230734 -0.442705 -0.245381 0.272913 -0.043196 -0.271495 0.337542 0.123149 -0.607634 -0.541339 -0.098934 -0.331350 0.017308 -0.442366 -0.797707 -0.662886 0.630965 0.047538 -0.762512 -0.739542 -0.157979 -0.646883 -0.394037 -0.403427 0.191149 0.282669 0.258315 0.235511 0.229247 0.201915 0.240037 0.279690 0.266202 0.230612 0.241914 0.232929 0.233040 0.260251 0.220542 0.245318 0.219398 0.212383 0.246926 0.229472 0.238017 0.244396 0.336282 0.206784 0.353753 0.263631 0.219655 0.257566 0.255084 0.368209
chargesum: 0.00000
title: Mulliken charges with hydrogens summed into heavy atoms:
elementType: F O O O O O C C C C C C C C C C C C C C C C C C C C C C
charge: -0.219329 -0.114968 -0.085876 -0.230734 -0.074496 -0.245381 0.272913 0.239473 -0.013180 0.337542 0.123149 -0.142876 -0.099387 0.180755 -0.065148 0.017308 0.030160 -0.071487 -0.197026 0.630965 0.047538 -0.083805 -0.027657 0.048806 -0.383251 0.083184 -0.148343 0.191149
polarizability: 3.17416722e+02 -1.90589557e+00 2.25927876e+02 -2.82785573e+01 5.14874677e+00 2.01458044e+02
1716.lowfreq: -140.9723 -14.4767 -7.3619 -0.0001 0.0001 0.0005 1.6978 26.5267 28.6713
frequency: -140.9670 26.4316 28.5621 39.0706 53.4210 73.7319 91.1960 113.6261 126.1937 133.0150 157.6235 169.0583 180.3876 191.8742 199.9323 207.7171 214.5340 224.5214 234.0440 236.7915 245.6381 253.7836 262.8109 276.0238 285.5415 295.6873 310.0892 319.5390 332.0096 341.8412 356.7623 368.2315 384.2510 394.4966 407.7709 415.7634 421.9314 449.2158 464.2877 474.9356 481.8894 499.5346 511.3111 519.1070 524.7394 563.3899 582.3866 595.6913 642.7840 652.9469 669.8991 688.7466 701.6969 735.7139 755.3946 778.3692 805.8477 820.9213 831.1666 852.4799 861.0405 866.4144 889.3575 901.0785 906.9513 918.7784 923.4123 926.8716 944.6176 950.6053 955.8035 959.9726 984.2688 987.8077 1004.2432 1012.4832 1028.4810 1030.1716 1043.0556 1052.8020 1075.1885 1079.5068 1099.5375 1102.9003 1112.2821 1124.6208 1136.5585 1140.6320 1149.0883 1160.2047 1165.7745 1168.7115 1176.9288 1183.1132 1197.2437 1204.5300 1214.7877 1222.8628 1241.2156 1247.6947 1248.8058 1255.9065 1275.8899 1283.0027 1290.9737 1298.9968 1310.6695 1315.3444 1323.5464 1332.3406 1345.6256 1349.7315 1352.6374 1358.4438 1365.0017 1378.5559 1379.9455 1384.0448 1390.6433 1391.4962 1411.7406 1438.4448 1443.1528 1459.4554 1464.1210 1464.9615 1466.6625 1470.2933 1478.0505 1483.2786 1487.7078 1494.1706 1560.2264 1595.2402 1619.6126 1666.8796 2943.8156 2967.0479 2968.5324 2981.6180 2985.4198 2988.7943 2999.0601 2999.8445 3001.9533 3006.9819 3009.7121 3010.9546 3014.8504 3038.0040 3048.7268 3057.3558 3063.3747 3073.2142 3077.8224 3096.7747 3101.6375 3102.1294 3117.9463 3122.1338 3132.5708 3149.5159 3409.3536 3545.5799 3579.5598
redmass: 1.2185 7.0370 6.0202 5.0417 6.0853 2.7977 4.2701 4.1524 2.7273 2.9602 4.2949 1.9314 3.7977 3.7068 2.2345 3.2105 2.3322 3.2257 1.9962 1.5048 2.6311 1.8483 2.7930 2.0581 3.8287 2.0261 2.9973 3.1937 5.1931 3.6030 3.1548 3.1424 3.9961 1.7655 2.2133 4.3522 3.3974 2.4518 3.2655 3.7138 2.6711 3.2775 3.9187 3.7297 3.4844 3.0453 4.3759 3.4771 4.1860 3.0231 4.0659 3.1167 3.9524 3.8919 4.5886 3.4061 1.7664 2.0863 2.7143 2.6459 3.4798 3.0632 3.2566 2.0639 1.9045 1.9253 1.6985 2.3568 2.2318 1.9248 2.1649 2.2939 2.1616 1.3880 2.6998 1.9330 2.6623 4.9249 2.2101 3.3286 2.2647 2.0693 3.0954 2.0762 2.0458 2.2682 2.1365 2.2822 2.5301 1.8920 2.1138 1.9456 1.1211 1.9496 1.8236 1.3547 1.3433 1.6048 1.5246 1.6368 1.5630 1.6800 1.3554 1.5691 2.0810 1.3897 1.4655 1.6305 1.3595 1.3546 1.7012 1.4254 1.4740 1.4577 1.4328 1.3224 1.3540 1.6213 1.2076 1.2992 1.1727 1.1047 1.0729 1.0706 1.0759 1.0640 1.0823 1.0465 1.0602 1.0680 1.0588 1.0589 8.7721 8.4299 8.6168 7.4642 1.0645 1.0607 1.0656 1.0764 1.0378 1.0668 1.0635 1.0938 1.0752 1.0392 1.0740 1.0509 1.0798 1.0996 1.0946 1.1009 1.1034 1.0992 1.0870 1.0970 1.0995 1.0994 1.0995 1.0989 1.0921 1.0965 1.0640 1.0656 1.0671
irintensity: 175.2081 3.5796 0.3988 3.1446 0.0584 0.3061 4.0809 0.4268 4.9951 3.4576 3.4159 2.0243 4.3821 1.6855 1.5296 2.6567 1.1252 24.6168 9.4919 0.1110 32.3534 40.3182 1.5279 31.0719 13.2574 69.2465 1.3043 13.9808 23.9043 3.5319 9.7371 4.4515 2.7162 66.9019 42.8330 0.5469 1.6653 7.1020 2.6662 9.7156 14.0031 7.8387 4.1188 2.4908 2.5665 2.1545 2.7057 1.3781 7.1448 0.1845 17.3349 5.4835 7.2625 8.8410 2.7779 8.3100 15.2105 2.6635 13.3630 8.3225 36.5737 0.9882 34.2211 61.7069 8.9773 5.4760 6.7341 0.6165 30.3503 14.5302 43.5090 22.7979 30.3161 0.8685 7.6229 16.1343 12.9933 110.0480 4.1675 22.3877 2.2729 17.9404 18.2261 9.9371 1.4496 6.9133 7.0438 18.6200 0.1228 1.1045 20.2471 13.9126 11.7340 20.0683 29.5861 6.6727 8.2989 3.5914 53.9582 10.6172 36.7658 107.8128 3.4504 10.1012 20.6076 6.1940 4.5425 5.2955 3.3118 2.1970 2.7227 4.2066 1.9314 5.5721 2.3803 10.8870 82.3979 7.4256 20.7984 11.1853 32.8052 4.3082 18.2696 10.7975 9.3251 17.2326 14.8292 10.3498 5.5350 3.1007 6.9648 5.1527 191.5166 62.0971 16.2741 138.9564 51.7678 22.8736 19.9234 6.9446 32.9077 18.6314 24.6448 10.4271 10.1632 24.8124 32.1075 6.6806 9.1981 19.2219 25.2831 24.0470 23.5798 32.6575 33.2976 19.6258 24.9949 21.1427 15.2873 11.0090 8.9013 11.8015 25.4880 4.1173 8.9961
temp: 298.150 k
press: 1.00000 atm
elementType: 9 8 8 8 8 8 6 6 6 6 6 6 6 6 6 6 6 6 6 6 6 6 6 6 6 6 6 6 1 1 1 1 1 1 1 1 1 1 1 1 1 1 1 1 1 1 1 1 1 1 1 1 1 1 1 1 1
symmnumber: 1
zpe: 1229508.9 jmol-1
zpe.correction: 0.468295 hartree
zpe.thermalcorrener: 0.495435 hartree
zpe.thermalcorrenthalpy: 0.496379 hartree
zpe.thermalcorrgfe: 0.413031 hartree
zpe.sumelectzpe: -1329.522610 hartree
zpe.sumelectthermal: -1329.495471 hartree
zpe.sumelectthermalent: -1329.494527 hartree
zpe.sumelectthermalfe: -1329.577875 hartree
dipole: -0.1935 0.3179 3.3735
dipole: 3.3940
quadrupole: -231.7218 -154.8140 -173.2321
quadrupole: -10.3647 20.2043 2.2787
quadrupole: -45.1325 31.7753 13.3572 -10.3647 20.2043 2.2787
hfenergy: -1329.9909056 hartree
pointgroup: C01 [X(C22H29F1O5)]
dipole: -0.1139458 -0.1461497 -1.3223625 debye
polarizability: 318.9235413|1.7028685|226.0560671|25.0345608|4.4546759|199.8230338 unknown
InChI: InChI=1S/C22H29FO5/c1-12-8-16-15-5-4-13-9-14(25)6-7-19(13,2)21(15,23)17(26)10-20(16,3)22(12,28)18(27)11-24/h6-7,9,12,15-17,24,26,28H,4-5,8,10-11H2,1-3H3
charge 0 multiplicity 1
57 atoms
F  1.465676 0.074822 1.321151
O  -2.913673 -0.339945 1.915739
O  0.367526 2.256517 -1.46688
O  -4.949341 0.520662 -0.946728
O  -5.856397 2.435235 0.668956
O  6.37061 0.373371 1.513914
C  -1.741607 0.213314 -0.269968
C  -0.87125 -1.05755 -0.018737
C  0.527547 -0.971965 -0.662664
C  1.26626 0.296103 -0.150894
C  -3.084628 -0.268999 0.449114
C  -1.795417 -2.239537 -0.397951
C  -1.025454 1.417478 0.384967
C  -3.24956 -1.742869 -0.070371
C  0.424115 1.617394 -0.134046
C  2.739004 0.42103 -0.730458
C  1.351776 -2.246606 -0.343888
C  -2.013963 0.484599 -1.772703
C  2.829209 -2.159981 -0.807871
C  3.477744 -0.870306 -0.349155
C  -4.302322 0.605262 0.136628
C  -4.024524 -2.656877 0.898137
C  2.753533 0.538501 -2.299427
C  3.427822 1.664325 -0.194681
C  4.645025 -0.857186 0.362395
C  -4.768752 1.62943 1.175972
C  4.592317 1.65274 0.508699
C  5.282743 0.382487 0.848362
H  -0.712272 -1.112607 1.077417
H  0.418261 -0.87379 -1.760717
H  -1.70515 -2.495178 -1.471393
H  -1.551478 -3.148581 0.179244
H  -0.932216 1.26365 1.479879
H  -1.56247 2.36911 0.211307
H  -3.833422 -1.664575 -1.006169
H  0.938624 2.291208 0.578565
H  0.866033 -3.117613 -0.820698
H  1.328231 -2.411305 0.749322
H  -2.546247 -0.3509 -2.255053
H  -2.635307 1.387073 -1.902648
H  -1.074342 0.672893 -2.313229
H  2.862879 -2.225358 -1.914921
H  3.396383 -3.025545 -0.421998
H  -5.043461 -2.273949 1.091078
H  -4.122444 -3.666996 0.459816
H  -3.505583 -2.739989 1.867091
H  2.256093 -0.319062 -2.780461
H  2.237723 1.449411 -2.63762
H  3.802324 0.565656 -2.642061
H  -2.484268 0.490344 2.245127
H  2.974566 2.629993 -0.463524
H  0.969043 3.041405 -1.479317
H  5.159893 -1.79254 0.614073
H  -3.919192 2.290601 1.455262
H  -5.079752 1.081886 2.088779
H  5.077856 2.576349 0.844587
H  -6.089026 2.068461 -0.232348
