program: Gaussian 09
title: 000005754
version: EM64L-G09RevD.01
frameworkgroup: C1[X(C21H30O5)]
method: RPBEPBE
basis: SDD
operation: Freq
keyword: #pfreq=noraman
keyword: PBEPBE/SDD
title: #p freq=noraman PBEPBE/SDD
converged: YES YES NO NO
title: Mulliken charges:
elementType: O O O O O C C C C C C C C C C C C C C C C C C C C C H H H H H H H H H H H H H H H H H H H H H H H H H H H H H H
charge: -0.449510 -0.465865 -0.232993 -0.443510 -0.238299 0.396561 -0.108804 -0.197215 -0.154757 0.113366 -0.654694 0.240157 -0.146662 -0.547720 -0.566051 -0.473979 -0.862312 0.536705 -0.637608 -0.499589 -0.795861 0.108810 -0.571993 -0.592174 0.178782 -0.354464 0.256837 0.257711 0.215498 0.256806 0.252279 0.220488 0.225218 0.247001 0.244949 0.213878 0.222351 0.213875 0.249803 0.273774 0.213693 0.227113 0.232737 0.211028 0.236226 0.209231 0.281930 0.215823 0.341644 0.243366 0.232826 0.346155 0.253328 0.227178 0.229929 0.367003
chargesum: 0.00000
title: Mulliken charges with hydrogens summed into heavy atoms:
elementType: O O O O O C C C C C C C C C C C C C C C C C C C C C
charge: -0.107866 -0.119710 -0.232993 -0.076507 -0.238299 0.396561 0.148033 0.060495 0.060742 0.113366 -0.145608 0.240157 0.073826 -0.075500 -0.107224 -0.037753 -0.125042 0.536705 -0.177758 -0.052335 -0.088877 0.108810 -0.095802 -0.338846 0.178782 0.102643
polarizability: 3.06694339e+02 -5.11648761e+00 2.16670218e+02 -1.80138282e+01 -1.51944016e+00 1.82442027e+02
1716.lowfreq: -15.6084 -7.7601 -3.5616 -0.0002 0.0004 0.0006 25.4750 44.8762 47.4960
frequency: 25.3936 44.8492 47.4216 61.1185 71.5409 83.6735 117.2717 127.4177 148.8908 164.0455 171.9671 184.2345 200.2564 203.5701 206.9205 225.8851 230.7849 252.3993 253.2866 261.0096 267.0579 282.8616 300.6685 308.1821 320.7253 335.1145 351.9143 362.3510 373.2853 374.7111 388.6444 411.8312 418.8000 427.0911 446.3210 468.9444 490.4526 508.5605 520.0274 528.1922 558.2505 561.4553 580.1859 617.1724 638.3747 657.1893 689.9218 731.8627 751.2326 755.6490 772.5031 775.3363 792.2915 824.5981 844.7020 849.2128 870.9012 882.9641 901.5946 911.3934 919.3339 929.6263 943.2039 951.2076 958.4137 971.9388 985.0565 985.2589 1016.7472 1023.7674 1028.9902 1030.7160 1033.9368 1044.0335 1049.5675 1066.1251 1080.5914 1094.0008 1113.6386 1116.0747 1123.5893 1124.5629 1134.5439 1156.0094 1175.2836 1176.3216 1186.0389 1187.0669 1192.7756 1199.0277 1210.9549 1217.2608 1226.9621 1241.1315 1246.9339 1254.3692 1268.9879 1272.2227 1278.3986 1283.1984 1290.1574 1299.4413 1300.0215 1311.3997 1321.9726 1326.6325 1333.1640 1339.0037 1343.1805 1346.2753 1351.9043 1359.2951 1371.9662 1381.3667 1381.8300 1393.6864 1395.1363 1441.2292 1443.3511 1457.0340 1458.8692 1465.9951 1466.5070 1467.9932 1472.1750 1475.4623 1485.6202 1497.1113 1504.8957 1584.4238 1605.0483 1624.1070 2916.2532 2948.2292 2953.8105 2954.6798 2958.0777 2960.9885 2968.6577 2982.6117 2984.5979 2985.8762 2989.8927 2990.7179 2992.5490 2994.6696 3003.8872 3029.4414 3038.2480 3044.7259 3045.4154 3048.1709 3062.8219 3069.5757 3073.8941 3082.1504 3106.9724 3115.7793 3122.8656 3411.4521 3552.9379 3554.3115
redmass: 6.3636 4.2232 4.4653 4.5449 5.2677 4.0571 2.0738 3.3847 4.7276 3.1162 2.4182 2.7960 1.8610 2.6366 2.3056 2.4620 1.6121 2.8053 1.9208 2.8290 3.5351 2.4910 2.6887 3.6047 2.8272 1.2667 4.1983 2.6194 3.1708 3.0303 2.5825 2.5364 1.4682 3.6212 2.9068 2.9562 2.9685 3.4684 3.3240 2.5454 2.8931 2.7810 3.1370 3.9585 3.3074 4.2261 3.2964 4.1231 4.1235 3.4985 2.1922 2.2018 2.4225 2.3096 2.7424 2.5089 2.4311 1.4780 2.8240 1.9575 2.0305 1.8174 2.3764 2.0679 2.3575 2.3228 2.5889 2.3510 2.0722 2.1334 2.6858 2.0533 2.2659 2.5775 2.3054 2.3594 2.3364 1.6899 1.8988 2.7439 1.8853 1.5129 1.6684 2.2367 1.6193 1.5586 1.1623 1.8455 1.6572 1.8867 1.3570 1.8128 1.3361 1.6626 1.5234 1.5417 1.6391 1.5045 1.9752 1.3546 1.4461 1.5631 1.5220 1.5609 1.4142 1.4679 1.3686 1.4835 1.9057 1.4663 1.3935 1.3549 1.4663 1.4690 1.3440 1.2270 1.2017 1.0723 1.0788 1.0790 1.0712 1.0836 1.0875 1.0851 1.0646 1.0703 1.0859 1.0548 1.0589 9.9827 8.6410 7.7938 1.0803 1.0806 1.0570 1.0809 1.0669 1.0607 1.0658 1.0632 1.0654 1.0629 1.1013 1.0429 1.0465 1.0698 1.0645 1.0967 1.0975 1.0973 1.0972 1.0975 1.0962 1.1026 1.0979 1.0971 1.0989 1.0911 1.0976 1.0641 1.0658 1.0666
irintensity: 1.8920 3.4459 1.8451 2.3120 1.6199 4.2094 1.8348 2.3584 0.9024 7.6263 0.6063 6.9131 77.0569 7.2596 17.3991 13.4247 9.2382 4.1372 1.2285 14.1029 7.5830 7.1847 1.5846 11.4512 26.9856 139.5669 3.3637 1.5625 7.3105 5.9338 10.8684 12.8539 70.1428 9.6310 10.4830 2.0573 5.4780 5.0135 6.6659 0.2677 0.1250 22.4806 2.0167 7.9499 4.7483 2.0185 2.9056 8.3751 2.7822 1.8508 8.3061 4.1810 5.5927 9.6548 6.5567 16.5613 14.0970 28.9531 83.8995 47.3777 6.7156 11.4956 15.2579 13.2727 8.2305 5.4580 0.7775 29.6189 0.3811 21.7216 36.9495 13.7701 34.7983 10.7873 5.6022 28.5443 0.9997 22.1309 12.8168 7.7308 5.2104 1.7795 14.2507 6.1686 9.2226 7.0467 10.1966 20.7401 2.1269 12.8954 2.5949 6.5626 18.1230 25.9299 88.8053 32.4692 13.6261 27.5934 27.1358 8.6746 8.2148 8.2038 7.7872 27.9429 1.4235 10.1241 2.4434 8.8848 4.2551 4.6697 4.6375 3.9555 2.3180 1.8321 95.1243 4.5349 47.2109 7.2488 21.7280 12.5809 16.2319 4.6614 7.4334 14.9896 6.7517 12.4903 2.6917 5.4546 14.1036 169.3299 57.2747 198.4462 8.7093 7.8816 52.6882 39.0536 15.7074 26.7821 33.6102 18.2242 39.3485 39.4939 19.1276 18.0115 18.9346 38.9758 22.4924 56.0383 30.1205 7.6767 24.3720 12.4556 25.2190 44.1023 38.6794 17.9997 8.3887 11.6117 4.2550 28.3932 3.6361 9.4606
temp: 298.150 k
press: 1.00000 atm
elementType: 8 8 8 8 8 6 6 6 6 6 6 6 6 6 6 6 6 6 6 6 6 6 6 6 6 6 1 1 1 1 1 1 1 1 1 1 1 1 1 1 1 1 1 1 1 1 1 1 1 1 1 1 1 1 1 1
symmnumber: 1
zpe: 1242159.5 jmol-1
zpe.correction: 0.473114 hartree
zpe.thermalcorrener: 0.498642 hartree
zpe.thermalcorrenthalpy: 0.499587 hartree
zpe.thermalcorrgfe: 0.419775 hartree
zpe.sumelectzpe: -1192.310954 hartree
zpe.sumelectthermal: -1192.285425 hartree
zpe.sumelectthermalent: -1192.284481 hartree
zpe.sumelectthermalfe: -1192.364292 hartree
dipole: -4.2815 3.2378 1.7545
dipole: 5.6474
quadrupole: -223.0220 -144.4658 -159.1419
quadrupole: -13.8080 13.6201 -1.5111
quadrupole: -47.4788 31.0774 16.4013 -13.8080 13.6201 -1.5111
hfenergy: -1192.7840673 hartree
pointgroup: C01 [X(C21H30O5)]
dipole: 1.6754337 -1.265918 0.7259541 debye
polarizability: 306.4907975|-5.1361691|216.7676919|18.6579399|0.639683|182.5480942 unknown
InChI: InChI=1S/C21H30O5/c1-19-7-5-13(23)9-12(19)3-4-14-15-6-8-21(26,17(25)11-22)20(15,2)10-16(24)18(14)19/h9,14-16,18,22,24,26H,3-8,10-11H2,1-2H3
charge 0 multiplicity 1
56 atoms
O  3.03971 -0.442063 -1.860262
O  -0.311603 2.187704 1.261218
O  4.416092 1.720745 0.07031
O  6.894791 0.880218 -0.452393
O  -6.441956 0.154676 -1.563219
C  1.894191 0.128053 0.250415
C  1.003683 -1.139644 0.06095
C  -0.420165 -0.987067 0.631222
C  -1.106265 0.235253 -0.059697
C  3.227876 -0.39977 -0.374222
C  1.22624 1.29742 -0.505261
C  -2.615952 0.451275 0.379033
C  -0.245077 1.532128 -0.071839
C  1.899603 -2.306101 0.553588
C  3.358767 -1.845796 0.207214
C  -1.241276 -2.269318 0.347025
C  2.138667 0.467519 1.748913
C  -3.367115 -0.870836 0.13624
C  -2.736489 -2.123246 0.715553
C  -3.22564 1.586885 -0.499467
C  -2.784443 0.802669 1.893826
C  4.47144 0.492743 -0.21696
C  -4.767976 1.607174 -0.512433
C  -4.578118 -0.93169 -0.506117
C  -5.342866 0.256481 -0.935123
C  5.85048 -0.115412 -0.515782
H  0.889023 -1.259746 -1.038701
H  -0.372731 -0.821084 1.725961
H  -1.16557 -0.041446 -1.139444
H  1.242169 1.069919 -1.587585
H  1.802162 2.234784 -0.370511
H  -0.693595 2.231556 -0.80921
H  1.64428 -3.263509 0.067793
H  1.789751 -2.45202 1.64428
H  3.992347 -1.847496 1.112028
H  3.851812 -2.522283 -0.518831
H  -0.810444 -3.125959 0.900444
H  -1.157106 -2.508151 -0.733953
H  2.743002 1.386335 1.8356
H  1.182765 0.64341 2.26509
H  2.677163 -0.338993 2.279594
H  -2.822016 -2.078173 1.821942
H  -3.302429 -3.016614 0.393383
H  -2.874216 1.455878 -1.544007
H  -2.844656 2.562047 -0.14503
H  -2.3197 0.04474 2.548225
H  -2.303845 1.767204 2.111811
H  -3.857335 0.85313 2.156056
H  3.533822 -1.218394 -2.228535
H  -5.158127 2.387238 -1.189806
H  -5.161449 1.83782 0.49872
H  0.386335 2.890608 1.286768
H  -5.067648 -1.899316 -0.680081
H  5.836442 -0.579161 -1.524093
H  6.053676 -0.921049 0.221184
H  6.45232 1.746026 -0.216625
